[jboss-as7-dev] Build failed in Jenkins: as7-7.1-testsuite #392

ci-builds at redhat.com ci-builds at redhat.com
Tue Aug 28 08:32:16 EDT 2012


See <http://lightning.mw.lab.eng.bos.redhat.com/jenkins/job/as7-7.1-testsuite/392/>

------------------------------------------
[...truncated 20067 lines...]
[debug] execute contextualize
[INFO] Using 'UTF-8' encoding to copy filtered resources.
[INFO] skip non existing resourceDirectory <http://lightning.mw.lab.eng.bos.redhat.com/jenkins/job/as7-7.1-testsuite/ws/testsuite/benchmark/src/main/resources>
[INFO] 
[INFO] --- maven-resources-plugin:2.5:copy-resources (ts.copy-jbossas.groups) @ jboss-as-testsuite-benchmark ---
[debug] execute contextualize
[INFO] Using 'UTF-8' encoding to copy filtered resources.
[INFO] skip non existing resourceDirectory <http://lightning.mw.lab.eng.bos.redhat.com/jenkins/job/as7-7.1-testsuite/ws/testsuite/benchmark/../build/target/jboss-as-7.1.3.Final-SNAPSHOT>
[INFO] 
[INFO] --- maven-resources-plugin:2.5:testResources (default-testResources) @ jboss-as-testsuite-benchmark ---
[debug] execute contextualize
[INFO] Using 'UTF-8' encoding to copy filtered resources.
[INFO] skip non existing resourceDirectory <http://lightning.mw.lab.eng.bos.redhat.com/jenkins/job/as7-7.1-testsuite/ws/testsuite/benchmark/src/test/resources>
[INFO] skip non existing resourceDirectory <http://lightning.mw.lab.eng.bos.redhat.com/jenkins/job/as7-7.1-testsuite/ws/testsuite/benchmark/src/test/java>
[INFO] 
[INFO] --- xml-maven-plugin:1.0:transform (ts.config-as.ip) @ jboss-as-testsuite-benchmark ---
[WARNING] The directory <http://lightning.mw.lab.eng.bos.redhat.com/jenkins/job/as7-7.1-testsuite/ws/testsuite/benchmark/target/jbossas/standalone/configuration,> which is a base directory of a ValidationSet or TransformationSet, does not exist.
[WARNING] No files found for transformation by stylesheet <http://lightning.mw.lab.eng.bos.redhat.com/jenkins/job/as7-7.1-testsuite/ws/testsuite/benchmark/../integration/src/test/xslt/changeIPAddresses.xsl>
[INFO] 
[INFO] --- xml-maven-plugin:1.0:transform (ts.config-as.trace-logging) @ jboss-as-testsuite-benchmark ---
[WARNING] The directory <http://lightning.mw.lab.eng.bos.redhat.com/jenkins/job/as7-7.1-testsuite/ws/testsuite/benchmark/target/jbossas/standalone/configuration,> which is a base directory of a ValidationSet or TransformationSet, does not exist.
[WARNING] No files found for transformation by stylesheet <http://lightning.mw.lab.eng.bos.redhat.com/jenkins/job/as7-7.1-testsuite/ws/testsuite/benchmark/../integration/src/test/xslt/enableTrace.xsl>
[INFO] 
[INFO] --- maven-compiler-plugin:2.3.2:testCompile (default-testCompile) @ jboss-as-testsuite-benchmark ---
[INFO] No sources to compile
[INFO] 
[INFO] --- maven-surefire-plugin:2.11:test (default-test) @ jboss-as-testsuite-benchmark ---
[INFO] No tests to run.
[INFO] Surefire report directory: <http://lightning.mw.lab.eng.bos.redhat.com/jenkins/job/as7-7.1-testsuite/ws/testsuite/benchmark/target/surefire-reports>

-------------------------------------------------------
 T E S T S
-------------------------------------------------------

Results :

Tests run: 0, Failures: 0, Errors: 0, Skipped: 0

[INFO]                                                                         
[INFO] ------------------------------------------------------------------------
[INFO] Building JBoss Application Server Test Suite: Stress Tests 7.1.3.Final-SNAPSHOT
[INFO] ------------------------------------------------------------------------
[INFO] 
[INFO] --- maven-clean-plugin:2.4.1:clean (default-clean) @ jboss-as-testsuite-stress ---
[INFO] Deleting <http://lightning.mw.lab.eng.bos.redhat.com/jenkins/job/as7-7.1-testsuite/ws/testsuite/stress/target>
[INFO] 
[INFO] --- maven-enforcer-plugin:1.0:enforce (ban-bad-dependencies) @ jboss-as-testsuite-stress ---
[INFO] 
[INFO] --- maven-enforcer-plugin:1.0:enforce (enforce-java-version) @ jboss-as-testsuite-stress ---
[INFO] 
[INFO] --- maven-enforcer-plugin:1.0:enforce (enforce-maven-version) @ jboss-as-testsuite-stress ---
[INFO] 
[INFO] --- buildnumber-maven-plugin:1.0:create-timestamp (get-build-timestamp) @ jboss-as-testsuite-stress ---
[INFO] 
[INFO] --- buildnumber-maven-plugin:1.0:create (get-scm-revision) @ jboss-as-testsuite-stress ---
[INFO] 
[INFO] --- maven-help-plugin:2.1.1:active-profiles (help.active-profiles) @ jboss-as-testsuite-stress ---
[INFO] Active profile report written to: <http://lightning.mw.lab.eng.bos.redhat.com/jenkins/job/as7-7.1-testsuite/ws/testsuite/stress/target/help.active-profiles.txt>
[INFO] 
[INFO] --- maven-help-plugin:2.1.1:effective-pom (help.effective-pom) @ jboss-as-testsuite-stress ---
[INFO] Effective-POM written to: <http://lightning.mw.lab.eng.bos.redhat.com/jenkins/job/as7-7.1-testsuite/ws/testsuite/stress/target/help.effective-pom.txt>
[INFO] 
[INFO] --- maven-help-plugin:2.1.1:effective-settings (help.effective-settings) @ jboss-as-testsuite-stress ---
[INFO] Effective-settings written to: <http://lightning.mw.lab.eng.bos.redhat.com/jenkins/job/as7-7.1-testsuite/ws/testsuite/stress/target/help.effective-settings.txt>
[INFO] 
[INFO] --- maven-help-plugin:2.1.1:system (help.system) @ jboss-as-testsuite-stress ---
[INFO] System report written to: <http://lightning.mw.lab.eng.bos.redhat.com/jenkins/job/as7-7.1-testsuite/ws/testsuite/stress/target/help.system.txt>
[INFO] 
[INFO] --- properties-maven-plugin:1.0-alpha-2:write-project-properties (default) @ jboss-as-testsuite-stress ---
[INFO] 
[INFO] --- maven-dependency-plugin:2.3:copy (copy-annotations-endorsed) @ jboss-as-testsuite-stress ---
[INFO] Configured Artifact: org.jboss.spec.javax.annotation:jboss-annotations-api_1.1_spec:?:jar
[INFO] Copying jboss-annotations-api_1.1_spec-1.0.1.Final.jar to <http://lightning.mw.lab.eng.bos.redhat.com/jenkins/job/as7-7.1-testsuite/ws/testsuite/stress/target/endorsed/jboss-annotations-api_1.1_spec-1.0.1.Final.jar>
[INFO] 
[INFO] --- maven-resources-plugin:2.5:resources (default-resources) @ jboss-as-testsuite-stress ---
[debug] execute contextualize
[INFO] Using 'UTF-8' encoding to copy filtered resources.
[INFO] skip non existing resourceDirectory <http://lightning.mw.lab.eng.bos.redhat.com/jenkins/job/as7-7.1-testsuite/ws/testsuite/stress/src/main/resources>
[INFO] 
[INFO] --- maven-resources-plugin:2.5:copy-resources (ts.copy-jbossas.groups) @ jboss-as-testsuite-stress ---
[debug] execute contextualize
[INFO] Using 'UTF-8' encoding to copy filtered resources.
[INFO] skip non existing resourceDirectory <http://lightning.mw.lab.eng.bos.redhat.com/jenkins/job/as7-7.1-testsuite/ws/testsuite/stress/../build/target/jboss-as-7.1.3.Final-SNAPSHOT>
[INFO] 
[INFO] --- maven-resources-plugin:2.5:testResources (default-testResources) @ jboss-as-testsuite-stress ---
[debug] execute contextualize
[INFO] Using 'UTF-8' encoding to copy filtered resources.
[INFO] skip non existing resourceDirectory <http://lightning.mw.lab.eng.bos.redhat.com/jenkins/job/as7-7.1-testsuite/ws/testsuite/stress/src/test/resources>
[INFO] skip non existing resourceDirectory <http://lightning.mw.lab.eng.bos.redhat.com/jenkins/job/as7-7.1-testsuite/ws/testsuite/stress/src/test/java>
[INFO] 
[INFO] --- xml-maven-plugin:1.0:transform (ts.config-as.ip) @ jboss-as-testsuite-stress ---
[WARNING] The directory <http://lightning.mw.lab.eng.bos.redhat.com/jenkins/job/as7-7.1-testsuite/ws/testsuite/stress/target/jbossas/standalone/configuration,> which is a base directory of a ValidationSet or TransformationSet, does not exist.
[WARNING] No files found for transformation by stylesheet <http://lightning.mw.lab.eng.bos.redhat.com/jenkins/job/as7-7.1-testsuite/ws/testsuite/stress/../integration/src/test/xslt/changeIPAddresses.xsl>
[INFO] 
[INFO] --- xml-maven-plugin:1.0:transform (ts.config-as.trace-logging) @ jboss-as-testsuite-stress ---
[WARNING] The directory <http://lightning.mw.lab.eng.bos.redhat.com/jenkins/job/as7-7.1-testsuite/ws/testsuite/stress/target/jbossas/standalone/configuration,> which is a base directory of a ValidationSet or TransformationSet, does not exist.
[WARNING] No files found for transformation by stylesheet <http://lightning.mw.lab.eng.bos.redhat.com/jenkins/job/as7-7.1-testsuite/ws/testsuite/stress/../integration/src/test/xslt/enableTrace.xsl>
[INFO] 
[INFO] --- maven-compiler-plugin:2.3.2:testCompile (default-testCompile) @ jboss-as-testsuite-stress ---
[INFO] No sources to compile
[INFO] 
[INFO] --- maven-surefire-plugin:2.11:test (default-test) @ jboss-as-testsuite-stress ---
[INFO] No tests to run.
[INFO] Surefire report directory: <http://lightning.mw.lab.eng.bos.redhat.com/jenkins/job/as7-7.1-testsuite/ws/testsuite/stress/target/surefire-reports>

-------------------------------------------------------
 T E S T S
-------------------------------------------------------

Results :

Tests run: 0, Failures: 0, Errors: 0, Skipped: 0

[INFO] ------------------------------------------------------------------------
[INFO] Reactor Summary:
[INFO] 
[INFO] JBoss Application Server: Build Configuration ..... SUCCESS [4.519s]
[INFO] JBoss Application Server: Parent Aggregator ....... SUCCESS [1.633s]
[INFO] JBoss Application Server: Domain HTTP Interface ... SUCCESS [0.420s]
[INFO] JBoss Application Server: Domain HTTP Error Context  SUCCESS [1.667s]
[INFO] JBoss Application Server: Protocol Utilities ...... SUCCESS [14.998s]
[INFO] JBoss Application Server: Controller Client ....... SUCCESS [7.222s]
[INFO] JBoss Application Server: Controller Core ......... SUCCESS [33.589s]
[INFO] JBoss Application Server: Domain Management ....... SUCCESS [9.578s]
[INFO] JBoss Application Server: Domain HTTP Interface ... SUCCESS [4.652s]
[INFO] JBoss Application Server: Deployment Repository ... SUCCESS [3.167s]
[INFO] JBoss Application Server: Embedded ................ SUCCESS [4.306s]
[INFO] JBoss Application Server: Platform MBean integration  SUCCESS [6.844s]
[INFO] JBoss Application Server: Process Controller ...... SUCCESS [9.750s]
[INFO] JBoss Application Server: Network ................. SUCCESS [3.269s]
[INFO] JBoss Application Server: Threading Subsystem ..... SUCCESS [10.526s]
[INFO] JBoss Application Server: Remoting Subsystem ...... SUCCESS [7.147s]
[INFO] JBoss Application Server: Server .................. SUCCESS [14.205s]
[INFO] JBoss Application Server: Subsystem Test Harness .. SUCCESS [10.895s]
[INFO] JBoss Application Server: JMX Subsystem ........... SUCCESS [15.860s]
[INFO] JBoss Application Server: Naming Subsystem ........ SUCCESS [12.810s]
[INFO] JBoss Application Server: EE ...................... SUCCESS [12.052s]
[INFO] JBoss Application Server: JacORB Subsystem ........ SUCCESS [14.324s]
[INFO] JBoss Application Server: Transaction Subsystem ... SUCCESS [10.235s]
[INFO] JBoss Application Server: Clustering Subsystem .... SUCCESS [0.365s]
[INFO] JBoss Application Server: Clustering Server API ... SUCCESS [13.254s]
[INFO] JBoss Application Server: Common code for clustering subsystems  SUCCESS [4.683s]
[INFO] JBoss Application Server: JGroups Subsystem ....... SUCCESS [11.653s]
[INFO] JBoss Application Server: Infinispan Subsystem .... SUCCESS [43.762s]
[INFO] JBoss Application Server: Security Subsystem ...... SUCCESS [10.895s]
[INFO] JBoss Application Server: Connector Subsystem ..... SUCCESS [17.980s]
[INFO] JBoss Application Server: Clustered registry service  SUCCESS [1.919s]
[INFO] JBoss Application Server: EJB Subsystem ........... SUCCESS [27.431s]
[INFO] JBoss Application Server: Distributed Web Session SPI  SUCCESS [4.532s]
[INFO] JBoss Application Server: Clustering Server API implementation  SUCCESS [4.749s]
[INFO] JBoss Application Server: Distributed Web Session Infinispan provider  SUCCESS [7.274s]
[INFO] JBoss Application Server: Web Subsystem ........... SUCCESS [29.482s]
[INFO] JBoss Application Server: Web Services Subsystem .. SUCCESS [0.172s]
[INFO] JBoss Application Server: Web Services Server Integration Subsystem  SUCCESS [14.351s]
[INFO] JBoss Application Server: Application Client Bootstrap  SUCCESS [6.477s]
[INFO] JBoss Application Server: Config Assembly ......... SUCCESS [3.245s]
[INFO] JBoss Application Server: Command line interface .. SUCCESS [11.820s]
[INFO] JBoss Application Server: EJB Client BOM .......... SUCCESS [0.331s]
[INFO] JBoss Application Server: JMS Client BOM .......... SUCCESS [0.408s]
[INFO] JBoss Application Server: EJB and JMS client combined jar  SUCCESS [3.291s]
[INFO] JBoss Application Server: Clustered Stateful Session Bean cache Infinispan provider  SUCCESS [5.561s]
[INFO] JBoss Application Server: Clustered service provider registry services  SUCCESS [3.643s]
[INFO] JBoss Application Server: Clustered singleton services  SUCCESS [4.481s]
[INFO] JBoss Application Server: EJB Container Managed Persistence Subsystem  SUCCESS [23.286s]
[INFO] JBoss Application Server: Config Admin ............ SUCCESS [7.133s]
[INFO] JBoss Application Server: Deployment Scanner ...... SUCCESS [11.424s]
[INFO] JBoss Application Server: EE Deployment ........... SUCCESS [4.798s]
[INFO] JBoss Application Server: JAXR Client ............. SUCCESS [11.385s]
[INFO] JBoss Application Server: JPA Subsystem ........... SUCCESS [0.165s]
[INFO] JBoss Application Server: JPA SPI ................. SUCCESS [5.126s]
[INFO] JBoss Application Server: JPA UTIL ................ SUCCESS [2.217s]
[INFO] JBoss Application Server: JPA Subsystem ........... SUCCESS [7.679s]
[INFO] JBoss Application Server: Weld Integration ........ SUCCESS [12.041s]
[INFO] JBoss Application Server: JAX-RS Integration ...... SUCCESS [7.077s]
[INFO] JBoss Application Server: JBoss Diagnostic Reporter  SUCCESS [2.244s]
[INFO] JBoss Application Server: JDR ..................... SUCCESS [12.563s]
[INFO] JBoss Application Server: JSF Support jar ......... SUCCESS [2.647s]
[INFO] JBoss Application Server: JSR-77 Subsystem ........ SUCCESS [8.512s]
[INFO] JBoss Application Server: Management Client Content  SUCCESS [2.734s]
[INFO] JBoss Application Server: Host Controller ......... SUCCESS [16.098s]
[INFO] JBoss Application Server: Logging Subsystem ....... SUCCESS [12.093s]
[INFO] JBoss Application Server: Mail subsystem .......... SUCCESS [8.857s]
[INFO] JBoss Application Server: Messaging Subsystem ..... SUCCESS [15.883s]
[INFO] JBoss Application Server: ModCluster Subsystem .... SUCCESS [9.222s]
[INFO] JBoss Application Server: OSGi .................... SUCCESS [0.213s]
[INFO] JBoss Application Server: OSGi Subsystem .......... SUCCESS [12.337s]
[INFO] JBoss Application Server: OSGi ConfigurationAdmin . SUCCESS [5.236s]
[INFO] JBoss Application Server: POJO Subsystem .......... SUCCESS [7.974s]
[INFO] JBoss Application Server: sosreport scripts ....... SUCCESS [1.634s]
[INFO] JBoss Application Server: Service Archive Subsystem  SUCCESS [10.653s]
[INFO] JBoss Application Server: XTS Subsystem ........... SUCCESS [6.504s]
[INFO] JBoss Application Server: Hibernate 3.6.x JPA integration  SUCCESS [3.073s]
[INFO] JBoss Application Server: Hibernate 4.0.x JPA integration  SUCCESS [5.368s]
[INFO] JBoss Application Server: OpenJPA 2.x JPA integration  SUCCESS [4.650s]
[INFO] JBoss Application Server: Build ................... SUCCESS [31.450s]
[INFO] JBoss Application Server: Arquillian .............. SUCCESS [0.317s]
[INFO] JBoss Application Server: Arquillian TestEnricher MSC  SUCCESS [2.429s]
[INFO] JBoss Application Server: Arquillian Common ....... SUCCESS [4.050s]
[INFO] JBoss Application Server: Arquillian Protocol JMX . SUCCESS [3.551s]
[INFO] JBoss Application Server: Arquillian Managed Container  SUCCESS [22.113s]
[INFO] JBoss Application Server: Arquillian Remote Container  SUCCESS [2.547s]
[INFO] JBoss Application Server: Exported Java EE Specification APIs  SUCCESS [0.084s]
[INFO] JBoss Application Server: Arquillian TestNG Integration  SUCCESS [24.799s]
[INFO] JBoss Application Server: Arquillian Common Domain  SUCCESS [7.057s]
[INFO] JBoss Application Server: Arquillian Remote Domain Container  SUCCESS [2.894s]
[INFO] JBoss Application Server: Arquillian Managed Domain Container  SUCCESS [39.984s]
[INFO] JBoss Application Server: Distribution ............ SUCCESS [5.807s]
[INFO] JBoss Application Server: Remoting Subsystem Test . SUCCESS [4.312s]
[INFO] JBoss Application Server: Validation Tests for Exported Java EE Specification APIs  SUCCESS [1.247s]
[INFO] JBoss Application Server: Web Services Tests Integration Subsystem  SUCCESS [2.510s]
[INFO] JBoss Application Server Test Suite: Shared ....... SUCCESS [17.335s]
[INFO] JBoss Application Server Test Suite: Aggregator ... SUCCESS [13.233s]
[INFO] JBoss Application Server Test Suite: Integration .. SUCCESS [4.115s]
[INFO] JBoss Application Server Test Suite: Integration - Smoke  SUCCESS [2:11.736s]
[INFO] JBoss Application Server Test Suite: Integration - Basic  FAILURE [2:42.589s]
[INFO] JBoss Application Server Test Suite: Integration - Clustering  SUCCESS [12:49.109s]
[INFO] JBoss Application Server Test Suite: Integration - IIOP  SUCCESS [37.984s]
[INFO] JBoss Application Server Test Suite: Integration - XTS  SUCCESS [33.899s]
[INFO] JBoss Application Server Test Suite: Integration - Multinode Tests  SUCCESS [43.485s]
[INFO] JBoss Application Server Test Suite: Integration - Manual Mode Tests  SUCCESS [7:50.691s]
[INFO] JBoss Application Server Test Suite: Compatibility Tests  SUCCESS [51.499s]
[INFO] JBoss Application Server Test Suite: Domain Mode Integration Tests  SUCCESS [4:18.733s]
[INFO] JBoss Application Server Test Suite: Benchmark Tests  SUCCESS [12.884s]
[INFO] JBoss Application Server Test Suite: Stress Tests . SUCCESS [4.224s]
[INFO] ------------------------------------------------------------------------
[INFO] BUILD FAILURE
[INFO] ------------------------------------------------------------------------
[INFO] Total time: 47:39.951s
[INFO] Finished at: Tue Aug 28 08:31:34 EDT 2012
[INFO] Final Memory: 253M/455M
[INFO] ------------------------------------------------------------------------
[ERROR] Failed to execute goal org.apache.maven.plugins:maven-surefire-plugin:2.11:test (basic-integration-default-full.surefire) on project jboss-as-ts-integ-basic: There are test failures.
[ERROR] 
[ERROR] Please refer to <http://lightning.mw.lab.eng.bos.redhat.com/jenkins/job/as7-7.1-testsuite/ws/testsuite/integration/basic/target/surefire-reports> for the individual test results.
[ERROR] -> [Help 1]
[ERROR] 
[ERROR] To see the full stack trace of the errors, re-run Maven with the -e switch.
[ERROR] Re-run Maven using the -X switch to enable full debug logging.
[ERROR] 
[ERROR] For more information about the errors and possible solutions, please read the following articles:
[ERROR] [Help 1] http://cwiki.apache.org/confluence/display/MAVEN/MojoFailureException
[ERROR] 
[ERROR] After correcting the problems, you can resume the build with the command
[ERROR]   mvn <goals> -rf :jboss-as-ts-integ-basic
+ gzip testsuite/integration/basic/target/jbossas/standalone/log/server.log
+ exit 1
Build step 'Execute shell' marked build as failure
Archiving artifacts
Recording test results


More information about the jboss-as7-dev mailing list