[jbosstools-fuse-dev] Build failed in Jenkins: Fuse-Tooling-pullrequest #622

Fuse Jenkins fuse-infra at redhat.com
Fri Nov 25 07:01:31 EST 2016


See <http://10.8.63.16/job/Fuse-Tooling-pullrequest/622/changes>

Changes:

[vcornejoe] - add org.eclipse.graphiti.ui to required bundles - modify assertion

------------------------------------------
[...truncated 1840 lines...]
[INFO] 
[INFO] --- maven-surefire-plugin:2.19.1:test (test) @ org.fusesource.ide.launcher ---
[INFO] No tests to run.
[INFO] 
[INFO] --- tycho-source-plugin:0.26.0:plugin-source (plugin-source) @ org.fusesource.ide.launcher ---
[INFO] Building jar: <http://10.8.63.16/job/Fuse-Tooling-pullrequest/ws/editor/plugins/org.fusesource.ide.launcher/target/org.fusesource.ide.launcher-9.1.0-SNAPSHOT-sources.jar>
[INFO] 
[INFO] --- target-platform-configuration:0.26.0:target-platform (default-target-platform) @ org.fusesource.ide.launcher ---
[INFO] 
[INFO] --- tycho-packaging-plugin:0.26.0:package-plugin (default-package-plugin) @ org.fusesource.ide.launcher ---
[INFO] Building jar: <http://10.8.63.16/job/Fuse-Tooling-pullrequest/ws/editor/plugins/org.fusesource.ide.launcher/target/org.fusesource.ide.launcher-9.1.0-SNAPSHOT.jar>
[INFO] 
[INFO] --- tycho-p2-plugin:0.26.0:p2-metadata-default (default-p2-metadata-default) @ org.fusesource.ide.launcher ---
[INFO] 
[INFO] --- tycho-source-feature-plugin:0.26.0:source-feature (source-feature) @ org.fusesource.ide.launcher ---
[INFO] 
[INFO] --- tycho-p2-plugin:0.26.0:p2-metadata (attached-p2-metadata) @ org.fusesource.ide.launcher ---
[INFO] 
[INFO] --- repository-utils:0.25.0-SNAPSHOT:generate-repository-facade (generate-facade) @ org.fusesource.ide.launcher ---
[INFO] 
[INFO] --- tycho-p2-extras-plugin:0.26.0:compare-version-with-baselines (default) @ org.fusesource.ide.launcher ---
[INFO]                                                                         
[INFO] ------------------------------------------------------------------------
[INFO] Building JBoss Fuse Tooling :: Camel Editor :: Plugins :: Camel Editor 9.1.0-SNAPSHOT
[INFO] ------------------------------------------------------------------------
[INFO] 
[INFO] --- maven-clean-plugin:3.0.0:clean (default-clean) @ org.fusesource.ide.camel.editor ---
[INFO] 
[INFO] --- tycho-packaging-plugin:0.26.0:build-qualifier (default-build-qualifier) @ org.fusesource.ide.camel.editor ---
[INFO] The project's OSGi version is 9.1.0.Alpha3-v20161125-1121
[INFO] 
[INFO] --- tycho-packaging-plugin:0.26.0:validate-id (default-validate-id) @ org.fusesource.ide.camel.editor ---
[INFO] 
[INFO] --- tycho-packaging-plugin:0.26.0:validate-version (default-validate-version) @ org.fusesource.ide.camel.editor ---
[INFO] 
[INFO] --- build-helper-maven-plugin:1.7:regex-property (regex-property) @ org.fusesource.ide.camel.editor ---
[INFO] Setting property 'skipTestsOrITests' to ''.
[INFO] 
[INFO] --- jacoco-maven-plugin:0.7.1.201405082137:prepare-agent (default) @ org.fusesource.ide.camel.editor ---
[INFO] argLine set to -javaagent:/home/jenkins/.m2/repository/org/jacoco/org.jacoco.agent/0.7.1.201405082137/org.jacoco.agent-0.7.1.201405082137-runtime.jar=destfile=<http://10.8.63.16/job/Fuse-Tooling-pullrequest/ws/editor/target/jacoco.exec,append=true,includes=org.jboss.tools.*>
[INFO] 
[INFO] --- maven-resources-plugin:2.7:resources (default-resources) @ org.fusesource.ide.camel.editor ---
[INFO] Using 'UTF-8' encoding to copy filtered resources.
[INFO] skip non existing resourceDirectory <http://10.8.63.16/job/Fuse-Tooling-pullrequest/ws/editor/plugins/org.fusesource.ide.camel.editor/src/main/resources>
[INFO] 
[INFO] --- tycho-compiler-plugin:0.26.0:compile (default-compile) @ org.fusesource.ide.camel.editor ---
[INFO] Compiling 162 source files to <http://10.8.63.16/job/Fuse-Tooling-pullrequest/ws/editor/plugins/org.fusesource.ide.camel.editor/target/classes>
[INFO] 
[INFO] --- maven-resources-plugin:2.7:testResources (default-testResources) @ org.fusesource.ide.camel.editor ---
[INFO] Using 'UTF-8' encoding to copy filtered resources.
[INFO] skip non existing resourceDirectory <http://10.8.63.16/job/Fuse-Tooling-pullrequest/ws/editor/plugins/org.fusesource.ide.camel.editor/src/test/resources>
[INFO] 
[INFO] --- maven-compiler-plugin:3.5.1:testCompile (compiletests) @ org.fusesource.ide.camel.editor ---
[INFO] No sources to compile
[INFO] 
[INFO] --- maven-surefire-plugin:2.19.1:test (test) @ org.fusesource.ide.camel.editor ---
[INFO] No tests to run.
[INFO] 
[INFO] --- tycho-source-plugin:0.26.0:plugin-source (plugin-source) @ org.fusesource.ide.camel.editor ---
[INFO] Building jar: <http://10.8.63.16/job/Fuse-Tooling-pullrequest/ws/editor/plugins/org.fusesource.ide.camel.editor/target/org.fusesource.ide.camel.editor-9.1.0-SNAPSHOT-sources.jar>
[INFO] 
[INFO] --- target-platform-configuration:0.26.0:target-platform (default-target-platform) @ org.fusesource.ide.camel.editor ---
[INFO] 
[INFO] --- tycho-packaging-plugin:0.26.0:package-plugin (default-package-plugin) @ org.fusesource.ide.camel.editor ---
[INFO] Building jar: <http://10.8.63.16/job/Fuse-Tooling-pullrequest/ws/editor/plugins/org.fusesource.ide.camel.editor/target/org.fusesource.ide.camel.editor-9.1.0-SNAPSHOT.jar>
[INFO] 
[INFO] --- tycho-p2-plugin:0.26.0:p2-metadata-default (default-p2-metadata-default) @ org.fusesource.ide.camel.editor ---
[INFO] 
[INFO] --- tycho-source-feature-plugin:0.26.0:source-feature (source-feature) @ org.fusesource.ide.camel.editor ---
[INFO] 
[INFO] --- tycho-p2-plugin:0.26.0:p2-metadata (attached-p2-metadata) @ org.fusesource.ide.camel.editor ---
[INFO] 
[INFO] --- repository-utils:0.25.0-SNAPSHOT:generate-repository-facade (generate-facade) @ org.fusesource.ide.camel.editor ---
[INFO] 
[INFO] --- tycho-p2-extras-plugin:0.26.0:compare-version-with-baselines (default) @ org.fusesource.ide.camel.editor ---
[INFO]                                                                         
[INFO] ------------------------------------------------------------------------
[INFO] Building JBoss Fuse Tooling :: Core :: Tests :: Camel Service Core Integration Tests 9.1.0-SNAPSHOT
[INFO] ------------------------------------------------------------------------
[INFO] 
[INFO] --- maven-clean-plugin:3.0.0:clean (default-clean) @ org.fusesource.ide.camel.model.service.core.tests.integration ---
[INFO] 
[INFO] --- tycho-packaging-plugin:0.26.0:build-qualifier (default-build-qualifier) @ org.fusesource.ide.camel.model.service.core.tests.integration ---
[INFO] The project's OSGi version is 9.1.0.Alpha3-v20161125-1121
[INFO] 
[INFO] --- tycho-packaging-plugin:0.26.0:validate-id (default-validate-id) @ org.fusesource.ide.camel.model.service.core.tests.integration ---
[INFO] 
[INFO] --- tycho-packaging-plugin:0.26.0:validate-version (default-validate-version) @ org.fusesource.ide.camel.model.service.core.tests.integration ---
[INFO] 
[INFO] --- build-helper-maven-plugin:1.7:regex-property (regex-property) @ org.fusesource.ide.camel.model.service.core.tests.integration ---
[INFO] Setting property 'skipTestsOrITests' to ''.
[INFO] 
[INFO] --- jacoco-maven-plugin:0.7.1.201405082137:prepare-agent (default) @ org.fusesource.ide.camel.model.service.core.tests.integration ---
[INFO] tycho.testArgLine set to -javaagent:/home/jenkins/.m2/repository/org/jacoco/org.jacoco.agent/0.7.1.201405082137/org.jacoco.agent-0.7.1.201405082137-runtime.jar=destfile=<http://10.8.63.16/job/Fuse-Tooling-pullrequest/ws/core/target/jacoco.exec,append=true,includes=org.jboss.tools.*>
[INFO] 
[INFO] --- maven-resources-plugin:2.7:resources (default-resources) @ org.fusesource.ide.camel.model.service.core.tests.integration ---
[INFO] Using 'UTF-8' encoding to copy filtered resources.
[INFO] Copying 17 resources
[INFO] 
[INFO] --- tycho-compiler-plugin:0.26.0:compile (default-compile) @ org.fusesource.ide.camel.model.service.core.tests.integration ---
[INFO] Compiling 8 source files to <http://10.8.63.16/job/Fuse-Tooling-pullrequest/ws/core/tests/org.fusesource.ide.camel.model.service.core.tests.integration/target/classes>
[INFO] 
[INFO] --- maven-resources-plugin:2.7:testResources (default-testResources) @ org.fusesource.ide.camel.model.service.core.tests.integration ---
[INFO] Using 'UTF-8' encoding to copy filtered resources.
[INFO] skip non existing resourceDirectory <http://10.8.63.16/job/Fuse-Tooling-pullrequest/ws/core/tests/org.fusesource.ide.camel.model.service.core.tests.integration/src/test/resources>
[INFO] 
[INFO] --- maven-compiler-plugin:3.5.1:testCompile (compiletests) @ org.fusesource.ide.camel.model.service.core.tests.integration ---
[INFO] No sources to compile
[INFO] 
[INFO] --- maven-surefire-plugin:2.19.1:test (test) @ org.fusesource.ide.camel.model.service.core.tests.integration ---
[INFO] No tests to run.
[INFO] 
[INFO] --- tycho-source-plugin:0.26.0:plugin-source (plugin-source) @ org.fusesource.ide.camel.model.service.core.tests.integration ---
[WARNING] Bundle-Vendor header not found in <http://10.8.63.16/job/Fuse-Tooling-pullrequest/ws/core/tests/org.fusesource.ide.camel.model.service.core.tests.integration/META-INF/MANIFEST.MF,> fallback to 'unknown' for source bundle
[INFO] Building jar: <http://10.8.63.16/job/Fuse-Tooling-pullrequest/ws/core/tests/org.fusesource.ide.camel.model.service.core.tests.integration/target/org.fusesource.ide.camel.model.service.core.tests.integration-9.1.0-SNAPSHOT-sources.jar>
[INFO] 
[INFO] --- target-platform-configuration:0.26.0:target-platform (default-target-platform) @ org.fusesource.ide.camel.model.service.core.tests.integration ---
[INFO] 
[INFO] --- tycho-packaging-plugin:0.26.0:package-plugin (default-package-plugin) @ org.fusesource.ide.camel.model.service.core.tests.integration ---
[INFO] Building jar: <http://10.8.63.16/job/Fuse-Tooling-pullrequest/ws/core/tests/org.fusesource.ide.camel.model.service.core.tests.integration/target/org.fusesource.ide.camel.model.service.core.tests.integration-9.1.0-SNAPSHOT.jar>
[INFO] 
[INFO] --- tycho-p2-plugin:0.26.0:p2-metadata-default (default-p2-metadata-default) @ org.fusesource.ide.camel.model.service.core.tests.integration ---
[INFO] 
[INFO] --- tycho-source-feature-plugin:0.26.0:source-feature (source-feature) @ org.fusesource.ide.camel.model.service.core.tests.integration ---
[INFO] 
[INFO] --- tycho-p2-plugin:0.26.0:p2-metadata (attached-p2-metadata) @ org.fusesource.ide.camel.model.service.core.tests.integration ---
[INFO] 
[INFO] --- repository-utils:0.25.0-SNAPSHOT:generate-repository-facade (generate-facade) @ org.fusesource.ide.camel.model.service.core.tests.integration ---
[INFO] 
[INFO] --- tycho-surefire-plugin:0.26.0:test (default-test) @ org.fusesource.ide.camel.model.service.core.tests.integration ---
[INFO] Expected eclipse log file: <http://10.8.63.16/job/Fuse-Tooling-pullrequest/ws/core/tests/org.fusesource.ide.camel.model.service.core.tests.integration/target/work> sp at cé/.metadata/.log
[INFO] Command line:
	[/usr/lib/jvm/java-1.8.0-openjdk-1.8.0.111-2.b15.el7_3.x86_64/jre/bin/java, -Dosgi.noShutdown=false, -Dosgi.os=linux, -Dosgi.ws=gtk, -Dosgi.arch=x86_64, -javaagent:/home/jenkins/.m2/repository/org/jacoco/org.jacoco.agent/0.7.1.201405082137/org.jacoco.agent-0.7.1.201405082137-runtime.jar=destfile=<http://10.8.63.16/job/Fuse-Tooling-pullrequest/ws/core/target/jacoco.exec,append=true,includes=org.jboss.tools.*,> -XX:+HeapDumpOnOutOfMemoryError, -Dusage_reporting_enabled=false, -Dorg.jboss.tools.vpe.loadxulrunner=false, -Dosgi.clean=true, -jar, /home/jenkins/.m2/repository/p2/osgi/bundle/org.eclipse.equinox.launcher/1.3.200.v20160318-1642/org.eclipse.equinox.launcher-1.3.200.v20160318-1642.jar, -data, <http://10.8.63.16/job/Fuse-Tooling-pullrequest/ws/core/tests/org.fusesource.ide.camel.model.service.core.tests.integration/target/work> sp at cé, -install, <http://10.8.63.16/job/Fuse-Tooling-pullrequest/ws/core/tests/org.fusesource.ide.camel.model.service.core.tests.integration/target/work,> -configuration, <http://10.8.63.16/job/Fuse-Tooling-pullrequest/ws/core/tests/org.fusesource.ide.camel.model.service.core.tests.integration/target/work/configuration,> -application, org.eclipse.tycho.surefire.osgibooter.uitest, -testproperties, <http://10.8.63.16/job/Fuse-Tooling-pullrequest/ws/core/tests/org.fusesource.ide.camel.model.service.core.tests.integration/target/surefire.properties]>
[ERROR] Timeout 2400 s exceeded. Process was killed.
[INFO] ------------------------------------------------------------------------
[INFO] Reactor Summary:
[INFO] 
[INFO] JBoss Fuse Tooling :: Build Configuration .......... SUCCESS [  0.240 s]
[INFO] JBoss Fuse Tooling ................................. SUCCESS [  0.248 s]
[INFO] JBoss Fuse Tooling :: Tools ........................ SUCCESS [  0.008 s]
[INFO] JBoss Fuse Tooling :: Tools :: IDE Build Tools ..... SUCCESS [  1.321 s]
[INFO] JBoss Fuse Tooling :: Tools :: IDE Code Generator .. SUCCESS [  0.378 s]
[INFO] JBoss Fuse Tooling :: Core ......................... SUCCESS [  0.008 s]
[INFO] JBoss Fuse Tooling :: Core :: Plugins .............. SUCCESS [  0.006 s]
[INFO] JBoss Fuse Tooling :: Core :: Plugins :: Foundation Core SUCCESS [ 14.287 s]
[INFO] JBoss Fuse Tooling :: Core :: Plugins :: Preferences SUCCESS [  0.125 s]
[INFO] JBoss Fuse Tooling :: Core :: Plugins :: Foundation UI SUCCESS [  0.768 s]
[INFO] JBoss Fuse Tooling :: Core :: Plugins :: Camel Model Service API SUCCESS [  0.717 s]
[INFO] JBoss Fuse Tooling :: Core :: Plugins :: Camel 2.15.1.redhat-621084 Service Implementation SUCCESS [  0.432 s]
[INFO] JBoss Fuse Tooling :: Core :: Plugins :: Camel 2.15.1.redhat-621117 Service Implementation SUCCESS [  0.451 s]
[INFO] JBoss Fuse Tooling :: Core :: Plugins :: Camel 2.17.0.redhat-630187 Service Implementation SUCCESS [  0.502 s]
[INFO] JBoss Fuse Tooling :: Core :: Plugins :: Camel 2.17.3 Service Implementation SUCCESS [  0.504 s]
[INFO] JBoss Fuse Tooling :: Core :: Plugins :: Maven ..... SUCCESS [  0.203 s]
[INFO] JBoss Fuse Tooling :: Camel Editor ................. SUCCESS [  0.009 s]
[INFO] JBoss Fuse Tooling :: Camel Editor :: Plugins ...... SUCCESS [  0.005 s]
[INFO] JBoss Fuse Tooling :: Camel Editor :: Plugins :: Branding SUCCESS [  0.468 s]
[INFO] JBoss Fuse Tooling :: Core :: Plugins :: Camel Validation SUCCESS [  0.290 s]
[INFO] JBoss Fuse Tooling :: Core :: Plugins :: Cheat Sheets SUCCESS [  0.038 s]
[INFO] JBoss Fuse Tooling :: Core :: Plugins :: Graph ..... SUCCESS [  0.230 s]
[INFO] JBoss Fuse Tooling :: Core :: Plugins :: Help ...... SUCCESS [  0.927 s]
[INFO] JBoss Fuse Tooling :: Core :: Plugins :: Imports ... SUCCESS [  0.206 s]
[INFO] JBoss Fuse Tooling :: Core :: Plugins :: Branding .. SUCCESS [  0.034 s]
[INFO] JBoss Fuse Tooling :: Core :: Tests ................ SUCCESS [  0.005 s]
[INFO] JBoss Fuse Tooling :: Core :: Tests :: Camel Service Core Tests SUCCESS [  2.067 s]
[INFO] JBoss Fuse Tooling :: JMX .......................... SUCCESS [  0.005 s]
[INFO] JBoss Fuse Tooling :: JMX :: Plugins ............... SUCCESS [  0.004 s]
[INFO] JBoss Fuse Tooling :: JMX :: Plugins :: JMX Commons  SUCCESS [  0.310 s]
[INFO] JBoss Fuse Tooling :: Camel Editor :: Plugins :: Launcher SUCCESS [  0.408 s]
[INFO] JBoss Fuse Tooling :: Camel Editor :: Plugins :: Camel Editor SUCCESS [  0.861 s]
[INFO] JBoss Fuse Tooling :: Core :: Tests :: Camel Service Core Integration Tests FAILURE [40:00 min]
[INFO] JBoss Fuse Tooling :: Core :: Tests :: Camel Model Tests SKIPPED
[INFO] JBoss Fuse Tooling :: Core :: Tests :: Camel Validation Integration Tests SKIPPED
[INFO] JBoss Fuse Tooling :: Core :: Tests :: Camel Validation Tests SKIPPED
[INFO] JBoss Fuse Tooling :: Camel Editor :: Plugins :: Project SKIPPED
[INFO] JBoss Fuse Tooling :: Camel Editor :: Plugins :: Project Templates SKIPPED
[INFO] JBoss Fuse Tooling :: Camel Editor :: Tests ........ SKIPPED
[INFO] JBoss Fuse Tooling :: Camel Editor :: Tests :: Camel Editor Integration Tests SKIPPED
[INFO] JBoss Fuse Tooling :: Core :: Tests :: Camel Validation Integration Tests SKIPPED
[INFO] JBoss Fuse Tooling :: Core :: Features ............. SKIPPED
[INFO] JBoss Fuse Tooling :: Core :: Features :: Core Feature SKIPPED
[INFO] JBoss Fuse Tooling :: Camel Editor :: Plugins :: XSD Catalogs SKIPPED
[INFO] JBoss Fuse Tooling :: Camel Editor :: Plugins :: Launcher UI SKIPPED
[INFO] JBoss Fuse Tooling :: Camel Editor :: Tests :: Camel Editor Tests SKIPPED
[INFO] JBoss Fuse Tooling :: Camel Editor :: Tests :: Camel IDE Launcher Tests SKIPPED
[INFO] JBoss Fuse Tooling :: Camel Editor :: Tests :: Launcher UI Tests SKIPPED
[INFO] JBoss Fuse Tooling :: Camel Editor :: Tests :: Camel IDE Project Integration Tests SKIPPED
[INFO] JBoss Fuse Tooling :: Camel Editor :: Tests :: Project Templates Tests SKIPPED
[INFO] JBoss Fuse Tooling :: Camel Editor :: Tests :: project Templates Integration Tests SKIPPED
[INFO] JBoss Fuse Tooling :: Camel Editor :: Features ..... SKIPPED
[INFO] JBoss Fuse Tooling :: Camel Editor :: Features :: Camel Editor Feature SKIPPED
[INFO] JBoss Fuse Tooling :: Data Transformation .......... SKIPPED
[INFO] JBoss Fuse Tooling :: Data Transformation :: Plugins SKIPPED
[INFO] JBoss Fuse Tooling :: Data Transformation :: Plugins :: Core SKIPPED
[INFO] JBoss Fuse Tooling :: Data Transformation :: Plugins :: Editor SKIPPED
[INFO] JBoss Fuse Tooling :: Data Transformation :: Features SKIPPED
[INFO] JBoss Fuse Tooling :: Data Transformation :: Features :: Data Transformation Feature SKIPPED
[INFO] JBoss Fuse Tooling :: Core Transformation :: Tests . SKIPPED
[INFO] JBoss Fuse Tooling :: Core Transformation :: Tests :: Core Transformation Tests SKIPPED
[INFO] JBoss Fuse Tooling :: Core Transformation :: Tests :: Core Transformation Integration Tests SKIPPED
[INFO] JBoss Fuse Tooling :: Editor Transformation :: Tests :: Editor Transformation Tests SKIPPED
[INFO] JBoss Fuse Tooling :: Transformation Editor :: Tests :: Transformation Editor Integration Tests SKIPPED
[INFO] JBoss Fuse Tooling :: JMX :: Plugins :: Apache ActiveMQ Facade SKIPPED
[INFO] JBoss Fuse Tooling :: JMX :: Plugins :: Apache Camel Facade SKIPPED
[INFO] JBoss Fuse Tooling :: JMX :: Plugins :: JMX Diagram View SKIPPED
[INFO] JBoss Fuse Tooling :: Server Adapters .............. SKIPPED
[INFO] JBoss Fuse Tooling :: Server Adapters :: Plugins ... SKIPPED
[INFO] JBoss Fuse Tooling :: Server Adapters :: Plugins :: Apache Karaf Adapter Core SKIPPED
[INFO] JBoss Fuse Tooling :: JMX :: Plugins :: Apache Karaf Facade SKIPPED
[INFO] JBoss Fuse Tooling :: JMX :: Tests ................. SKIPPED
[INFO] JBoss Fuse Tooling :: JMX :: Tests ::Camel ......... SKIPPED
[INFO] JBoss Fuse Tooling :: JMX :: Integration Tests :: Camel SKIPPED
[INFO] JBoss Fuse Tooling :: JMX :: Tests :: Commons ...... SKIPPED
[INFO] JBoss Fuse Tooling :: JMX :: Tests :: Diagram ::View SKIPPED
[INFO] JBoss Fuse Tooling :: JMX :: Features .............. SKIPPED
[INFO] JBoss Fuse Tooling :: Server Adapters :: Plugins :: Commons SKIPPED
[INFO] JBoss Fuse Tooling :: Server Adapters :: Plugins :: Apache Karaf Adapter UI SKIPPED
[INFO] JBoss Fuse Tooling :: Server Adapters :: Plugins :: JBoss Fuse Adapter Core SKIPPED
[INFO] JBoss Fuse Tooling :: Server Adapters :: Plugins :: JBoss Fuse Adapter UI SKIPPED
[INFO] JBoss Fuse Tooling :: Server Adapters :: Features .. SKIPPED
[INFO] JBoss Fuse Tooling :: Server Adapters :: Features :: Server Adapters Feature SKIPPED
[INFO] JBoss Fuse Tooling :: JMX :: Features :: JMX Feature SKIPPED
[INFO] JBoss Fuse Tooling :: Server Adapters :: Tests ..... SKIPPED
[INFO] JBoss Fuse Tooling :: Server Adapters :: Tests :: Karaf Core Tests SKIPPED
[INFO] JBoss Fuse Tooling :: Server Adapters :: Tests :: Server Tests SKIPPED
[INFO] JBoss Fuse Tooling :: Update Site .................. SKIPPED
[INFO] ------------------------------------------------------------------------
[INFO] BUILD FAILURE
[INFO] ------------------------------------------------------------------------
[INFO] Total time: 41:07 min
[INFO] Finished at: 2016-11-25T07:01:27-05:00
[INFO] Final Memory: 299M/1537M
[INFO] ------------------------------------------------------------------------
[ERROR] Failed to execute goal org.eclipse.tycho:tycho-surefire-plugin:0.26.0:test (default-test) on project org.fusesource.ide.camel.model.service.core.tests.integration: An unexpected error occured while launching the test runtime (return code 143). See log for details. -> [Help 1]
[ERROR] 
[ERROR] To see the full stack trace of the errors, re-run Maven with the -e switch.
[ERROR] Re-run Maven using the -X switch to enable full debug logging.
[ERROR] 
[ERROR] For more information about the errors and possible solutions, please read the following articles:
[ERROR] [Help 1] http://cwiki.apache.org/confluence/display/MAVEN/MojoFailureException
[ERROR] 
[ERROR] After correcting the problems, you can resume the build with the command
[ERROR]   mvn <goals> -rf :org.fusesource.ide.camel.model.service.core.tests.integration
Build step 'Invoke top-level Maven targets' marked build as failure
Terminating xvnc.
$ vncserver -kill :53
Killing Xvnc process ID 9082
[locks-and-latches] Releasing all the locks
[locks-and-latches] All the locks released
Recording test results



More information about the jbosstools-fuse-dev mailing list