[jbosstools-fuse-dev] Build failed in Jenkins: Fuse-Tooling-pullrequest #893

Fuse Jenkins fuse-infra at redhat.com
Mon Feb 13 06:10:35 EST 2017


https://fusesource-jenkins.rhev-ci-vms.eng.rdu2.redhat.com/job/Fuse-Tooling-pullrequest/893/display/redirectChanges:

[Lars Heinemann] updating activator plugin id

------------------------------------------
[...truncated 8649 lines...]
[INFO] --- maven-compiler-plugin:3.5.1:testCompile (compiletests) @ org.fusesource.ide.updatesite ---
[INFO] No sources to compile
[INFO] 
[INFO] --- maven-surefire-plugin:2.19.1:test (test) @ org.fusesource.ide.updatesite ---
[INFO] No tests to run.
[INFO] 
[INFO] --- tycho-source-plugin:0.26.0:plugin-source (plugin-source) @ org.fusesource.ide.updatesite ---
[INFO] 
[INFO] --- target-platform-configuration:0.26.0:target-platform (default-target-platform) @ org.fusesource.ide.updatesite ---
[INFO] 
[INFO] --- tycho-p2-publisher-plugin:0.26.0:publish-products (default-publish-products) @ org.fusesource.ide.updatesite ---
[INFO] 
[INFO] --- tycho-p2-publisher-plugin:0.26.0:publish-categories (default-publish-categories) @ org.fusesource.ide.updatesite ---
[INFO] 
[INFO] --- tycho-p2-publisher-plugin:0.26.0:attach-artifacts (default-attach-artifacts) @ org.fusesource.ide.updatesite ---
[INFO] 
[INFO] --- tycho-p2-repository-plugin:0.26.0:assemble-repository (default-assemble-repository) @ org.fusesource.ide.updatesite ---
[INFO] 
[INFO] --- tycho-p2-repository-plugin:0.26.0:archive-repository (default-archive-repository) @ org.fusesource.ide.updatesite ---
[INFO] Building zip: <https://fusesource-jenkins.rhev-ci-vms.eng.rdu2.redhat.com/job/Fuse-Tooling-pullrequest/ws/site/target/org.fusesource.ide.updatesite-9.1.0-SNAPSHOT.zip>
[INFO] 
[INFO] --- tycho-source-feature-plugin:0.26.0:source-feature (source-feature) @ org.fusesource.ide.updatesite ---
[INFO] 
[INFO] --- tycho-p2-plugin:0.26.0:p2-metadata (attached-p2-metadata) @ org.fusesource.ide.updatesite ---
[INFO] 
[INFO] --- repository-utils:0.26.0:generate-repository-facade (generate-facade) @ org.fusesource.ide.updatesite ---
[INFO] Building zip: <https://fusesource-jenkins.rhev-ci-vms.eng.rdu2.redhat.com/job/Fuse-Tooling-pullrequest/ws/site/target/org.fusesource.ide.updatesite-9.1.0-SNAPSHOT.zip>
[INFO] 
[INFO] --- tycho-p2-extras-plugin:0.26.0:compare-version-with-baselines (default) @ org.fusesource.ide.updatesite ---
[INFO] ------------------------------------------------------------------------
[INFO] Reactor Summary:
[INFO] 
[INFO] JBoss Fuse Tooling :: Build Configuration .......... SUCCESS [  0.247 s]
[INFO] JBoss Fuse Tooling ................................. SUCCESS [  0.285 s]
[INFO] JBoss Fuse Tooling :: Tools ........................ SUCCESS [  0.008 s]
[INFO] JBoss Fuse Tooling :: Tools :: IDE Camel Catalog Generator SUCCESS [  1.651 s]
[INFO] JBoss Fuse Tooling :: Core ......................... SUCCESS [  0.008 s]
[INFO] JBoss Fuse Tooling :: Core :: Plugins .............. SUCCESS [  0.007 s]
[INFO] JBoss Fuse Tooling :: Core :: Plugins :: Foundation Core SUCCESS [  6.474 s]
[INFO] JBoss Fuse Tooling :: Core :: Plugins :: Preferences SUCCESS [  0.142 s]
[INFO] JBoss Fuse Tooling :: Core :: Plugins :: Foundation UI SUCCESS [  0.846 s]
[INFO] JBoss Fuse Tooling :: Core :: Plugins :: Camel Model Service API SUCCESS [  0.798 s]
[INFO] JBoss Fuse Tooling :: Core :: Plugins :: Camel 2.15.1.redhat-621084 Service Implementation SUCCESS [  0.436 s]
[INFO] JBoss Fuse Tooling :: Core :: Plugins :: Camel 2.15.1.redhat-621117 Service Implementation SUCCESS [  0.420 s]
[INFO] JBoss Fuse Tooling :: Core :: Plugins :: Camel 2.17.0.redhat-630187 Service Implementation SUCCESS [  0.622 s]
[INFO] JBoss Fuse Tooling :: Core :: Plugins :: Camel 2.17.0.redhat-630224 Service Implementation SUCCESS [  0.509 s]
[INFO] JBoss Fuse Tooling :: Core :: Plugins :: Camel 2.17.3 Service Implementation SUCCESS [  0.514 s]
[INFO] JBoss Fuse Tooling :: Core :: Plugins :: Camel 2.18.1.redhat-000012 Service Implementation SUCCESS [  1.015 s]
[INFO] JBoss Fuse Tooling :: Core :: Plugins :: Maven ..... SUCCESS [  0.218 s]
[INFO] JBoss Fuse Tooling :: Camel Editor ................. SUCCESS [  0.007 s]
[INFO] JBoss Fuse Tooling :: Camel Editor :: Plugins ...... SUCCESS [  0.005 s]
[INFO] JBoss Fuse Tooling :: Camel Editor :: Plugins :: Branding SUCCESS [  0.444 s]
[INFO] JBoss Fuse Tooling :: Core :: Plugins :: Camel Validation SUCCESS [  0.304 s]
[INFO] JBoss Fuse Tooling :: Core :: Plugins :: Cheat Sheets SUCCESS [  0.043 s]
[INFO] JBoss Fuse Tooling :: Core :: Plugins :: Graph ..... SUCCESS [  0.243 s]
[INFO] JBoss Fuse Tooling :: Core :: Plugins :: Help ...... SUCCESS [  1.148 s]
[INFO] JBoss Fuse Tooling :: Core :: Plugins :: Imports ... SUCCESS [  0.221 s]
[INFO] JBoss Fuse Tooling :: Core :: Plugins :: Branding .. SUCCESS [  0.040 s]
[INFO] JBoss Fuse Tooling :: Core :: Tests ................ SUCCESS [  0.006 s]
[INFO] JBoss Fuse Tooling :: Core :: Tests :: Camel Service Core Tests SUCCESS [  2.198 s]
[INFO] JBoss Fuse Tooling :: JMX .......................... SUCCESS [  0.006 s]
[INFO] JBoss Fuse Tooling :: JMX :: Plugins ............... SUCCESS [  0.005 s]
[INFO] JBoss Fuse Tooling :: JMX :: Plugins :: JMX Commons  SUCCESS [  0.321 s]
[INFO] JBoss Fuse Tooling :: Camel Editor :: Plugins :: Launcher SUCCESS [  0.351 s]
[INFO] JBoss Fuse Tooling :: Camel Editor :: Plugins :: Camel Editor SUCCESS [  0.974 s]
[INFO] JBoss Fuse Tooling :: Core :: Tests :: Camel Service Core Integration Tests SUCCESS [ 16.466 s]
[INFO] JBoss Fuse Tooling :: Core :: Tests :: Camel Model Tests FAILURE [  7.358 s]
[INFO] JBoss Fuse Tooling :: Core :: Tests :: Camel Validation Integration Tests SUCCESS [  0.526 s]
[INFO] JBoss Fuse Tooling :: Core :: Tests :: Camel Validation Tests SUCCESS [  1.648 s]
[INFO] JBoss Fuse Tooling :: Camel Editor :: Plugins :: Project SUCCESS [  0.370 s]
[INFO] JBoss Fuse Tooling :: Camel Editor :: Plugins :: Project Templates SUCCESS [  0.874 s]
[INFO] JBoss Fuse Tooling :: Camel Editor :: Tests ........ SUCCESS [  0.006 s]
[INFO] JBoss Fuse Tooling :: Camel Editor :: Tests :: Camel Editor Integration Tests SUCCESS [05:31 min]
[INFO] JBoss Fuse Tooling :: Core :: Tests :: Camel Validation Integration Tests FAILURE [ 14.312 s]
[INFO] JBoss Fuse Tooling :: Core :: Features ............. SUCCESS [  0.005 s]
[INFO] JBoss Fuse Tooling :: Core :: Features :: Core Feature SUCCESS [  0.256 s]
[INFO] JBoss Fuse Tooling :: Camel Editor :: Plugins :: XSD Catalogs SUCCESS [  0.099 s]
[INFO] JBoss Fuse Tooling :: Camel Editor :: Plugins :: Launcher UI SUCCESS [  0.355 s]
[INFO] JBoss Fuse Tooling :: Camel Editor :: Tests :: Camel Editor Tests SUCCESS [  3.283 s]
[INFO] JBoss Fuse Tooling :: Camel Editor :: Tests :: Camel IDE Launcher Tests SUCCESS [  1.629 s]
[INFO] JBoss Fuse Tooling :: Camel Editor :: Tests :: Launcher UI Tests SUCCESS [  1.812 s]
[INFO] JBoss Fuse Tooling :: Camel Editor :: Tests :: Camel IDE Project Integration Tests SUCCESS [  8.211 s]
[INFO] JBoss Fuse Tooling :: Camel Editor :: Tests :: Project Templates Tests SUCCESS [  2.007 s]
[INFO] JBoss Fuse Tooling :: Camel Editor :: Tests :: Project Templates Integration Tests FAILURE [18:11 min]
[INFO] JBoss Fuse Tooling :: Camel Editor :: Features ..... SUCCESS [  0.006 s]
[INFO] JBoss Fuse Tooling :: Camel Editor :: Features :: Camel Editor Feature SUCCESS [  0.173 s]
[INFO] JBoss Fuse Tooling :: Data Transformation .......... SUCCESS [  0.005 s]
[INFO] JBoss Fuse Tooling :: Data Transformation :: Plugins SUCCESS [  0.004 s]
[INFO] JBoss Fuse Tooling :: Data Transformation :: Plugins :: Core SUCCESS [  0.593 s]
[INFO] JBoss Fuse Tooling :: Data Transformation :: Plugins :: Editor SUCCESS [  0.715 s]
[INFO] JBoss Fuse Tooling :: Data Transformation :: Features SUCCESS [  0.005 s]
[INFO] JBoss Fuse Tooling :: Data Transformation :: Features :: Data Transformation Feature SUCCESS [  0.161 s]
[INFO] JBoss Fuse Tooling :: Core Transformation :: Tests . SUCCESS [  0.005 s]
[INFO] JBoss Fuse Tooling :: Core Transformation :: Tests :: Core Transformation Tests SUCCESS [  2.383 s]
[INFO] JBoss Fuse Tooling :: Core Transformation :: Tests :: Core Transformation Integration Tests SUCCESS [  9.510 s]
[INFO] JBoss Fuse Tooling :: Editor Transformation :: Tests :: Editor Transformation Tests SUCCESS [  1.654 s]
[INFO] JBoss Fuse Tooling :: Transformation Editor :: Tests :: Transformation Editor Integration Tests SUCCESS [ 10.622 s]
[INFO] JBoss Fuse Tooling :: JMX :: Plugins :: Apache ActiveMQ Facade SUCCESS [  0.739 s]
[INFO] JBoss Fuse Tooling :: JMX :: Plugins :: Apache Camel Facade SUCCESS [  0.469 s]
[INFO] JBoss Fuse Tooling :: JMX :: Plugins :: JMX Diagram View SUCCESS [  0.324 s]
[INFO] JBoss Fuse Tooling :: Server Adapters .............. SUCCESS [  0.005 s]
[INFO] JBoss Fuse Tooling :: Server Adapters :: Plugins ... SUCCESS [  0.004 s]
[INFO] JBoss Fuse Tooling :: Server Adapters :: Plugins :: Apache Karaf Adapter Core SUCCESS [  0.365 s]
[INFO] JBoss Fuse Tooling :: JMX :: Plugins :: Apache Karaf Facade SUCCESS [  0.333 s]
[INFO] JBoss Fuse Tooling :: JMX :: Tests ................. SUCCESS [  0.005 s]
[INFO] JBoss Fuse Tooling :: JMX :: Tests ::Camel ......... SUCCESS [  1.551 s]
[INFO] JBoss Fuse Tooling :: JMX :: Integration Tests :: Camel SUCCESS [  7.350 s]
[INFO] JBoss Fuse Tooling :: JMX :: Tests :: Commons ...... SUCCESS [  1.704 s]
[INFO] JBoss Fuse Tooling :: JMX :: Tests :: Diagram ::View SUCCESS [  1.740 s]
[INFO] JBoss Fuse Tooling :: JMX :: Features .............. SUCCESS [  0.005 s]
[INFO] JBoss Fuse Tooling :: Server Adapters :: Plugins :: Commons SUCCESS [  0.203 s]
[INFO] JBoss Fuse Tooling :: Server Adapters :: Plugins :: Apache Karaf Adapter UI SUCCESS [  0.519 s]
[INFO] JBoss Fuse Tooling :: Server Adapters :: Plugins :: JBoss Fuse Adapter Core SUCCESS [  0.278 s]
[INFO] JBoss Fuse Tooling :: Server Adapters :: Plugins :: JBoss Fuse Adapter UI SUCCESS [  0.307 s]
[INFO] JBoss Fuse Tooling :: Server Adapters :: Features .. SUCCESS [  0.004 s]
[INFO] JBoss Fuse Tooling :: Server Adapters :: Features :: Server Adapters Feature SUCCESS [  0.166 s]
[INFO] JBoss Fuse Tooling :: JMX :: Features :: JMX Feature SUCCESS [  0.203 s]
[INFO] JBoss Fuse Tooling :: Server Adapters :: Tests ..... SUCCESS [  0.004 s]
[INFO] JBoss Fuse Tooling :: Server Adapters :: Tests :: Karaf Core Tests SUCCESS [  1.706 s]
[INFO] JBoss Fuse Tooling :: Server Adapters :: Tests :: Server Tests SUCCESS [  9.831 s]
[INFO] JBoss Fuse Tooling :: Update Site .................. SUCCESS [  9.675 s]
[INFO] ------------------------------------------------------------------------
[INFO] BUILD FAILURE
[INFO] ------------------------------------------------------------------------
[INFO] Total time: 27:12 min
[INFO] Finished at: 2017-02-13T06:10:30-05:00
[INFO] Final Memory: 423M/1417M
[INFO] ------------------------------------------------------------------------
[ERROR] Failed to execute goal org.eclipse.tycho:tycho-surefire-plugin:0.26.0:test (default-test) on project org.fusesource.ide.camel.model.tests: There are test failures.
[ERROR] 
[ERROR] Please refer to <https://fusesource-jenkins.rhev-ci-vms.eng.rdu2.redhat.com/job/Fuse-Tooling-pullrequest/ws/core/tests/org.fusesource.ide.camel.model.tests/target/surefire-reports> for the individual test results.
[ERROR] -> [Help 1]
org.apache.maven.lifecycle.LifecycleExecutionException: Failed to execute goal org.eclipse.tycho:tycho-surefire-plugin:0.26.0:test (default-test) on project org.fusesource.ide.camel.model.tests: There are test failures.

Please refer to <https://fusesource-jenkins.rhev-ci-vms.eng.rdu2.redhat.com/job/Fuse-Tooling-pullrequest/ws/core/tests/org.fusesource.ide.camel.model.tests/target/surefire-reports> for the individual test results.
	at org.apache.maven.lifecycle.internal.MojoExecutor.execute(MojoExecutor.java:212)
	at org.apache.maven.lifecycle.internal.MojoExecutor.execute(MojoExecutor.java:153)
	at org.apache.maven.lifecycle.internal.MojoExecutor.execute(MojoExecutor.java:145)
	at org.apache.maven.lifecycle.internal.LifecycleModuleBuilder.buildProject(LifecycleModuleBuilder.java:116)
	at org.apache.maven.lifecycle.internal.LifecycleModuleBuilder.buildProject(LifecycleModuleBuilder.java:80)
	at org.apache.maven.lifecycle.internal.builder.singlethreaded.SingleThreadedBuilder.build(SingleThreadedBuilder.java:51)
	at org.apache.maven.lifecycle.internal.LifecycleStarter.execute(LifecycleStarter.java:128)
	at org.apache.maven.DefaultMaven.doExecute(DefaultMaven.java:307)
	at org.apache.maven.DefaultMaven.doExecute(DefaultMaven.java:193)
	at org.apache.maven.DefaultMaven.execute(DefaultMaven.java:106)
	at org.apache.maven.cli.MavenCli.execute(MavenCli.java:863)
	at org.apache.maven.cli.MavenCli.doMain(MavenCli.java:288)
	at org.apache.maven.cli.MavenCli.main(MavenCli.java:199)
	at sun.reflect.NativeMethodAccessorImpl.invoke0(Native Method)
	at sun.reflect.NativeMethodAccessorImpl.invoke(NativeMethodAccessorImpl.java:62)
	at sun.reflect.DelegatingMethodAccessorImpl.invoke(DelegatingMethodAccessorImpl.java:43)
	at java.lang.reflect.Method.invoke(Method.java:498)
	at org.codehaus.plexus.classworlds.launcher.Launcher.launchEnhanced(Launcher.java:289)
	at org.codehaus.plexus.classworlds.launcher.Launcher.launch(Launcher.java:229)
	at org.codehaus.plexus.classworlds.launcher.Launcher.mainWithExitCode(Launcher.java:415)
	at org.codehaus.plexus.classworlds.launcher.Launcher.main(Launcher.java:356)
Caused by: org.apache.maven.plugin.MojoFailureException: There are test failures.

Please refer to <https://fusesource-jenkins.rhev-ci-vms.eng.rdu2.redhat.com/job/Fuse-Tooling-pullrequest/ws/core/tests/org.fusesource.ide.camel.model.tests/target/surefire-reports> for the individual test results.
	at org.eclipse.tycho.surefire.TestMojo.runTest(TestMojo.java:998)
	at org.eclipse.tycho.surefire.TestMojo.execute(TestMojo.java:666)
	at org.apache.maven.plugin.DefaultBuildPluginManager.executeMojo(DefaultBuildPluginManager.java:134)
	at org.apache.maven.lifecycle.internal.MojoExecutor.execute(MojoExecutor.java:207)
	... 20 more
[ERROR] Failed to execute goal org.eclipse.tycho:tycho-surefire-plugin:0.26.0:test (default-test) on project org.fusesource.ide.camel.validation.tests.integration: There are test failures.
[ERROR] 
[ERROR] Please refer to <https://fusesource-jenkins.rhev-ci-vms.eng.rdu2.redhat.com/job/Fuse-Tooling-pullrequest/ws/core/tests/org.fusesource.ide.camel.validation.tests.integration/target/surefire-reports> for the individual test results.
[ERROR] -> [Help 1]
org.apache.maven.lifecycle.LifecycleExecutionException: Failed to execute goal org.eclipse.tycho:tycho-surefire-plugin:0.26.0:test (default-test) on project org.fusesource.ide.camel.validation.tests.integration: There are test failures.

Please refer to <https://fusesource-jenkins.rhev-ci-vms.eng.rdu2.redhat.com/job/Fuse-Tooling-pullrequest/ws/core/tests/org.fusesource.ide.camel.validation.tests.integration/target/surefire-reports> for the individual test results.
	at org.apache.maven.lifecycle.internal.MojoExecutor.execute(MojoExecutor.java:212)
	at org.apache.maven.lifecycle.internal.MojoExecutor.execute(MojoExecutor.java:153)
	at org.apache.maven.lifecycle.internal.MojoExecutor.execute(MojoExecutor.java:145)
	at org.apache.maven.lifecycle.internal.LifecycleModuleBuilder.buildProject(LifecycleModuleBuilder.java:116)
	at org.apache.maven.lifecycle.internal.LifecycleModuleBuilder.buildProject(LifecycleModuleBuilder.java:80)
	at org.apache.maven.lifecycle.internal.builder.singlethreaded.SingleThreadedBuilder.build(SingleThreadedBuilder.java:51)
	at org.apache.maven.lifecycle.internal.LifecycleStarter.execute(LifecycleStarter.java:128)
	at org.apache.maven.DefaultMaven.doExecute(DefaultMaven.java:307)
	at org.apache.maven.DefaultMaven.doExecute(DefaultMaven.java:193)
	at org.apache.maven.DefaultMaven.execute(DefaultMaven.java:106)
	at org.apache.maven.cli.MavenCli.execute(MavenCli.java:863)
	at org.apache.maven.cli.MavenCli.doMain(MavenCli.java:288)
	at org.apache.maven.cli.MavenCli.main(MavenCli.java:199)
	at sun.reflect.NativeMethodAccessorImpl.invoke0(Native Method)
	at sun.reflect.NativeMethodAccessorImpl.invoke(NativeMethodAccessorImpl.java:62)
	at sun.reflect.DelegatingMethodAccessorImpl.invoke(DelegatingMethodAccessorImpl.java:43)
	at java.lang.reflect.Method.invoke(Method.java:498)
	at org.codehaus.plexus.classworlds.launcher.Launcher.launchEnhanced(Launcher.java:289)
	at org.codehaus.plexus.classworlds.launcher.Launcher.launch(Launcher.java:229)
	at org.codehaus.plexus.classworlds.launcher.Launcher.mainWithExitCode(Launcher.java:415)
	at org.codehaus.plexus.classworlds.launcher.Launcher.main(Launcher.java:356)
Caused by: org.apache.maven.plugin.MojoFailureException: There are test failures.

Please refer to <https://fusesource-jenkins.rhev-ci-vms.eng.rdu2.redhat.com/job/Fuse-Tooling-pullrequest/ws/core/tests/org.fusesource.ide.camel.validation.tests.integration/target/surefire-reports> for the individual test results.
	at org.eclipse.tycho.surefire.TestMojo.runTest(TestMojo.java:998)
	at org.eclipse.tycho.surefire.TestMojo.execute(TestMojo.java:666)
	at org.apache.maven.plugin.DefaultBuildPluginManager.executeMojo(DefaultBuildPluginManager.java:134)
	at org.apache.maven.lifecycle.internal.MojoExecutor.execute(MojoExecutor.java:207)
	... 20 more
[ERROR] Failed to execute goal org.eclipse.tycho:tycho-surefire-plugin:0.26.0:test (default-test) on project org.fusesource.ide.projecttemplates.tests.integration: There are test failures.
[ERROR] 
[ERROR] Please refer to <https://fusesource-jenkins.rhev-ci-vms.eng.rdu2.redhat.com/job/Fuse-Tooling-pullrequest/ws/editor/tests/org.fusesource.ide.projecttemplates.tests.integration/target/surefire-reports> for the individual test results.
[ERROR] -> [Help 1]
org.apache.maven.lifecycle.LifecycleExecutionException: Failed to execute goal org.eclipse.tycho:tycho-surefire-plugin:0.26.0:test (default-test) on project org.fusesource.ide.projecttemplates.tests.integration: There are test failures.

Please refer to <https://fusesource-jenkins.rhev-ci-vms.eng.rdu2.redhat.com/job/Fuse-Tooling-pullrequest/ws/editor/tests/org.fusesource.ide.projecttemplates.tests.integration/target/surefire-reports> for the individual test results.
	at org.apache.maven.lifecycle.internal.MojoExecutor.execute(MojoExecutor.java:212)
	at org.apache.maven.lifecycle.internal.MojoExecutor.execute(MojoExecutor.java:153)
	at org.apache.maven.lifecycle.internal.MojoExecutor.execute(MojoExecutor.java:145)
	at org.apache.maven.lifecycle.internal.LifecycleModuleBuilder.buildProject(LifecycleModuleBuilder.java:116)
	at org.apache.maven.lifecycle.internal.LifecycleModuleBuilder.buildProject(LifecycleModuleBuilder.java:80)
	at org.apache.maven.lifecycle.internal.builder.singlethreaded.SingleThreadedBuilder.build(SingleThreadedBuilder.java:51)
	at org.apache.maven.lifecycle.internal.LifecycleStarter.execute(LifecycleStarter.java:128)
	at org.apache.maven.DefaultMaven.doExecute(DefaultMaven.java:307)
	at org.apache.maven.DefaultMaven.doExecute(DefaultMaven.java:193)
	at org.apache.maven.DefaultMaven.execute(DefaultMaven.java:106)
	at org.apache.maven.cli.MavenCli.execute(MavenCli.java:863)
	at org.apache.maven.cli.MavenCli.doMain(MavenCli.java:288)
	at org.apache.maven.cli.MavenCli.main(MavenCli.java:199)
	at sun.reflect.NativeMethodAccessorImpl.invoke0(Native Method)
	at sun.reflect.NativeMethodAccessorImpl.invoke(NativeMethodAccessorImpl.java:62)
	at sun.reflect.DelegatingMethodAccessorImpl.invoke(DelegatingMethodAccessorImpl.java:43)
	at java.lang.reflect.Method.invoke(Method.java:498)
	at org.codehaus.plexus.classworlds.launcher.Launcher.launchEnhanced(Launcher.java:289)
	at org.codehaus.plexus.classworlds.launcher.Launcher.launch(Launcher.java:229)
	at org.codehaus.plexus.classworlds.launcher.Launcher.mainWithExitCode(Launcher.java:415)
	at org.codehaus.plexus.classworlds.launcher.Launcher.main(Launcher.java:356)
Caused by: org.apache.maven.plugin.MojoFailureException: There are test failures.

Please refer to <https://fusesource-jenkins.rhev-ci-vms.eng.rdu2.redhat.com/job/Fuse-Tooling-pullrequest/ws/editor/tests/org.fusesource.ide.projecttemplates.tests.integration/target/surefire-reports> for the individual test results.
	at org.eclipse.tycho.surefire.TestMojo.runTest(TestMojo.java:998)
	at org.eclipse.tycho.surefire.TestMojo.execute(TestMojo.java:666)
	at org.apache.maven.plugin.DefaultBuildPluginManager.executeMojo(DefaultBuildPluginManager.java:134)
	at org.apache.maven.lifecycle.internal.MojoExecutor.execute(MojoExecutor.java:207)
	... 20 more
[ERROR] 
[ERROR] Re-run Maven using the -X switch to enable full debug logging.
[ERROR] 
[ERROR] For more information about the errors and possible solutions, please read the following articles:
[ERROR] [Help 1] http://cwiki.apache.org/confluence/display/MAVEN/MojoFailureException
[ERROR] 
[ERROR] After correcting the problems, you can resume the build with the command
[ERROR]   mvn <goals> -rf :org.fusesource.ide.camel.model.tests
Build step 'Invoke top-level Maven targets' marked build as failure
Terminating xvnc.
$ vncserver -kill :63
Killing Xvnc process ID 18714
Recording test results


More information about the jbosstools-fuse-dev mailing list