[jbossts-issues] [JBoss JIRA] (JBTM-1403) jbossts-narayana-skipTests build failure due to downloading some artifacts

Amos Feng (JIRA) jira-events at lists.jboss.org
Fri Dec 21 02:00:09 EST 2012

Amos Feng created JBTM-1403:

             Summary: jbossts-narayana-skipTests build failure due to downloading some artifacts
                 Key: JBTM-1403
                 URL: https://issues.jboss.org/browse/JBTM-1403
             Project: JBoss Transaction Manager
          Issue Type: Bug
      Security Level: Public (Everyone can see)
          Components: Testing
            Reporter: Amos Feng
            Assignee: Tom Jenkinson

Downloading: http://repo.maven.apache.org/maven2/org/apache/maven/wagon/wagon-webdav-jackrabbit/2.2/wagon-webdav-jackrabbit-2.2.pom

[ERROR] The build could not read 1 project -> [Help 1]
[ERROR]   The project org.jboss.as:jboss-as-parent:7.2.0.Alpha1-SNAPSHOT (C:\hudson\workspace\jbossts-narayana-skipTests\jboss-as\pom.xml) has 1 error
[ERROR]     Unresolveable build extension: Plugin org.apache.maven.wagon:wagon-webdav-jackrabbit:2.2 
            or one of its dependencies could not be resolved: Failed to collect dependencies for 
            org.apache.maven.wagon:wagon-webdav-jackrabbit:jar:2.2 (): Failed to read artifact descriptor for 
            org.apache.maven.wagon:wagon-webdav-jackrabbit:jar:2.2: Could not transfer artifact org.apache.maven.wagon:wagon-webdav-jackrabbit:pom:2.2 
            from/to central (http://repo.maven.apache.org/maven2): Failed to transfer file: http://repo.maven.apache.org/maven2/org/apache/maven/wagon/wagon-webdav-jackrabbit/2.2/wagon-webdav-jackrabbit-2.2.pom. 
            Return code is: 502, ReasonPhrase:Bad Gateway. -> [Help 2]

This message is automatically generated by JIRA.
If you think it was sent incorrectly, please contact your JIRA administrators
For more information on JIRA, see: http://www.atlassian.com/software/jira

More information about the jbossts-issues mailing list