[jbossts-issues] [JBoss JIRA] (JBTM-2170) Jacoco failed to create QA code coverage report

Gytis Trikleris (JIRA) issues at jboss.org
Mon May 12 05:47:56 EDT 2014


Gytis Trikleris created JBTM-2170:
-------------------------------------

             Summary: Jacoco failed to create QA code coverage report
                 Key: JBTM-2170
                 URL: https://issues.jboss.org/browse/JBTM-2170
             Project: JBoss Transaction Manager
          Issue Type: Bug
      Security Level: Public (Everyone can see)
          Components: Testing
            Reporter: Gytis Trikleris
            Assignee: Michael Musgrove
            Priority: Minor
             Fix For: 5.0.2


http://172.17.131.2/view/Narayana+BlackTie/job/narayana-codeCoverage/118

{code}
BUILD SUCCESSFUL
Total time: 510 minutes 46 seconds
generating test coverage report
Buildfile: /home/hudson/workspace/narayana-codeCoverage/qa/run-tests.xml

jacoco-report:
[jacoco:report] Loading execution data file /home/hudson/workspace/narayana-codeCoverage/qa/testoutput/jacoco-qa.exec

BUILD FAILED
/home/hudson/workspace/narayana-codeCoverage/qa/run-tests.xml:540: Error while creating report

Total time: 8 seconds
Buildfile: /home/hudson/workspace/narayana-codeCoverage/qa/run-tests.xml

has-testoutput-output:

testoutput.zip:
     [echo] archiving testoutput to testoutput-jacorb.zip
      [zip] Building zip: /home/hudson/workspace/narayana-codeCoverage/qa/testoutput-jacorb.zip

BUILD SUCCESSFUL
Total time: 9 seconds
+ rm -rf /home/hudson/.m2/repository/org/jboss/narayana
+ cd qa
+ ant -f run-tests.xml jacoco-report
Buildfile: /home/hudson/workspace/narayana-codeCoverage/qa/run-tests.xml

jacoco-report:
[jacoco:report] Loading execution data file /home/hudson/workspace/narayana-codeCoverage/qa/testoutput/jacoco-qa.exec

BUILD FAILED
/home/hudson/workspace/narayana-codeCoverage/qa/run-tests.xml:540: Error while creating report

Total time: 9 seconds
Build step 'Execute shell' marked build as failure
Archiving artifacts
Sending e-mails to: gtrikler at redhat.com
Finished: FAILURE
{code}



--
This message was sent by Atlassian JIRA
(v6.2.3#6260)


More information about the jbossts-issues mailing list