[keycloak-dev] Keycloak Integration TestSuite FAILURE

Maurício Giacomini Penteado mauriciogiacomini at hotmail.com
Tue Sep 13 10:20:01 EDT 2016

Hello Stian

I did a clone of master from Travis repository and to me the errors are the same  = /

De: Stian Thorgersen <sthorger at redhat.com>
Enviado: terça-feira, 13 de setembro de 2016 13:10
Para: Maurício Giacomini Penteado
Cc: keycloak-dev at lists.jboss.org
Assunto: Re: [keycloak-dev] Keycloak Integration TestSuite FAILURE

What steps do you run to build/test? Works on my box and also it works on Travis.

On 13 September 2016 at 15:08, Maurício Giacomini Penteado <mauriciogiacomini at hotmail.com<mailto:mauriciogiacomini at hotmail.com>> wrote:

Hello everybody.

All my attempts to build keycloak result in the same errors:

Keycloak Integration TestSuite FAILURE

Failed tests:
  JaxrsFilterTest.testCors:286 expected:<200> but was:<403>
  JaxrsFilterTest.testRelativeUriAndPublicKey:172 expected:<500> but was:<401>
Tests in error:
  JaxrsBasicAuthTest.testBasic:141 » ClientError HTTP 403 Forbidden
  JaxrsFilterTest.testBasic:141 » ClientError HTTP 403 Forbidden
  JaxrsFilterTest.testPushNotBefore:314 » ClientError HTTP 403 Forbidden
  JaxrsFilterTest.testResourceRoleMappings:236 » ClientError HTTP 403 Forbidden

Tests run: 414, Failures: 2, Errors: 4, Skipped: 32

If somebody has an idea about what happens, please let me know!

Kind regards,

keycloak-dev mailing list
keycloak-dev at lists.jboss.org<mailto:keycloak-dev at lists.jboss.org>

-------------- next part --------------
An HTML attachment was scrubbed...
URL: http://lists.jboss.org/pipermail/keycloak-dev/attachments/20160913/bb630583/attachment.html 

More information about the keycloak-dev mailing list