[switchyard-dev] Build failed in Jenkins: SwitchYard-Components #1059

ci-builds at redhat.com ci-builds at redhat.com
Wed Mar 20 23:01:42 EDT 2013


See <http://jenkins.mw.lab.eng.bos.redhat.com/hudson/job/SwitchYard-Components/1059/changes>

Changes:

[kbabo] bump to 0.8.0.Final

------------------------------------------
Started by an SCM change
[EnvInject] - Loading node environment variables.
Building remotely on vmg22-rhel4-x86_64 in workspace <http://jenkins.mw.lab.eng.bos.redhat.com/hudson/job/SwitchYard-Components/ws/>
Checkout:SwitchYard-Components / <http://jenkins.mw.lab.eng.bos.redhat.com/hudson/job/SwitchYard-Components/ws/> - hudson.remoting.Channel at 6b890bbd:vmg22-rhel4-x86_64
Using strategy: Default
Last Built Revision: Revision 8c3290fe3f6e763ef52c55b74cdd81766d59c322 (origin/master)
Fetching changes from 1 remote Git repository
Fetching upstream changes from git://github.com/jboss-switchyard/components.git
Commencing build of Revision eabf7c27d117ea516c9787724de9abf1ac9bec97 (origin/master)
Checking out Revision eabf7c27d117ea516c9787724de9abf1ac9bec97 (origin/master)
[SwitchYard-Components] $ /qa/tools/opt/apache-maven-3.0.3/bin/mvn -U -Dorg.switchyard.test.soap.port=45338 -Dorg.switchyard.test.soap.host=vmg22 clean install checkstyle:checkstyle findbugs:findbugs
[INFO] Scanning for projects...
Downloading: https://repository.jboss.org/nexus/content/repositories/deprecated/org/switchyard/switchyard-parent/0.8.0.Final/switchyard-parent-0.8.0.Final.pom

Downloading: https://repository.jboss.org/nexus/content/groups/developer/org/switchyard/switchyard-parent/0.8.0.Final/switchyard-parent-0.8.0.Final.pom

Downloading: http://snapshots.jboss.org/maven2/org/switchyard/switchyard-parent/0.8.0.Final/switchyard-parent-0.8.0.Final.pom

Downloading: http://repository.jboss.org/maven2/org/switchyard/switchyard-parent/0.8.0.Final/switchyard-parent-0.8.0.Final.pom

Downloading: https://repository.jboss.org/nexus/content/groups/public/org/switchyard/switchyard-parent/0.8.0.Final/switchyard-parent-0.8.0.Final.pom

Downloading: http://repo1.maven.org/maven2/org/switchyard/switchyard-parent/0.8.0.Final/switchyard-parent-0.8.0.Final.pom

[ERROR] The build could not read 1 project -> [Help 1]
[ERROR]   
[ERROR]   The project org.switchyard.components:switchyard-components-parent:0.8.0.Final (<http://jenkins.mw.lab.eng.bos.redhat.com/hudson/job/SwitchYard-Components/ws/pom.xml)> has 1 error
[ERROR]     Non-resolvable parent POM: Could not find artifact org.switchyard:switchyard-parent:pom:0.8.0.Final in jboss-deprecated (https://repository.jboss.org/nexus/content/repositories/deprecated/) and 'parent.relativePath' points at wrong local POM @ line 25, column 13 -> [Help 2]
[ERROR] 
[ERROR] To see the full stack trace of the errors, re-run Maven with the -e switch.
[ERROR] Re-run Maven using the -X switch to enable full debug logging.
[ERROR] 
[ERROR] For more information about the errors and possible solutions, please read the following articles:
[ERROR] [Help 1] http://cwiki.apache.org/confluence/display/MAVEN/ProjectBuildingException
[ERROR] [Help 2] http://cwiki.apache.org/confluence/display/MAVEN/UnresolvableModelException
Build step 'Invoke top-level Maven targets' marked build as failure
[CHECKSTYLE] Skipping publisher since build result is FAILURE
[FINDBUGS] Skipping publisher since build result is FAILURE


More information about the switchyard-dev mailing list