[switchyard-dev] Build failed in Jenkins: SwitchYard-Components #1209

ci-builds at redhat.com ci-builds at redhat.com
Mon Nov 11 19:53:30 EST 2013


See <http://jenkins.mw.lab.eng.bos.redhat.com/hudson/job/SwitchYard-Components/1209/changes>

Changes:

[dward] SWITCHYARD-1818: Descriptor validation errors due to config model version change

------------------------------------------
[...truncated 111 lines...]
[INFO]                                                                         
[INFO] ------------------------------------------------------------------------
[INFO] Building SwitchYard: Components 1.1.0.CR1
[INFO] ------------------------------------------------------------------------
[INFO] 
[INFO] --- maven-clean-plugin:2.5:clean (default-clean) @ switchyard-components-parent ---
[INFO] 
[INFO] --- maven-source-plugin:2.1.1:jar-no-fork (attach-sources) @ switchyard-components-parent ---
[INFO] 
[INFO] --- maven-install-plugin:2.3.1:install (default-install) @ switchyard-components-parent ---
[INFO] Installing <http://jenkins.mw.lab.eng.bos.redhat.com/hudson/job/SwitchYard-Components/ws/pom.xml> to /home/hudson/.m2/repository/org/switchyard/components/switchyard-components-parent/1.1.0.CR1/switchyard-components-parent-1.1.0.CR1.pom
[INFO] 
[INFO] --- maven-checkstyle-plugin:2.8:checkstyle (default-cli) @ switchyard-components-parent ---
[INFO] 
[INFO] --- findbugs-maven-plugin:2.3.2:findbugs (default-cli) @ switchyard-components-parent ---
[INFO] ****** FindBugsMojo execute *******
[INFO] canGenerate is false
[INFO]                                                                         
[INFO] ------------------------------------------------------------------------
[INFO] Building SwitchYard: Common Component Libraries Parent 1.1.0.CR1
[INFO] ------------------------------------------------------------------------
[INFO] 
[INFO] --- maven-clean-plugin:2.5:clean (default-clean) @ switchyard-component-common-parent ---
[INFO] 
[INFO] --- maven-source-plugin:2.1.1:jar-no-fork (attach-sources) @ switchyard-component-common-parent ---
[INFO] 
[INFO] --- maven-install-plugin:2.3.1:install (default-install) @ switchyard-component-common-parent ---
[INFO] Installing <http://jenkins.mw.lab.eng.bos.redhat.com/hudson/job/SwitchYard-Components/ws/common/pom.xml> to /home/hudson/.m2/repository/org/switchyard/components/switchyard-component-common-parent/1.1.0.CR1/switchyard-component-common-parent-1.1.0.CR1.pom
[INFO] 
[INFO] --- maven-checkstyle-plugin:2.8:checkstyle (default-cli) @ switchyard-component-common-parent ---
[INFO] 
[INFO] --- findbugs-maven-plugin:2.3.2:findbugs (default-cli) @ switchyard-component-common-parent ---
[INFO] ****** FindBugsMojo execute *******
[INFO] canGenerate is false
[INFO]                                                                         
[INFO] ------------------------------------------------------------------------
[INFO] Building SwitchYard: Common Component Library 1.1.0.CR1
[INFO] ------------------------------------------------------------------------
[INFO] 
[INFO] --- maven-clean-plugin:2.5:clean (default-clean) @ switchyard-component-common ---
[INFO] Deleting <http://jenkins.mw.lab.eng.bos.redhat.com/hudson/job/SwitchYard-Components/ws/common/common/target>
[INFO] 
[INFO] --- maven-resources-plugin:2.4.3:resources (default-resources) @ switchyard-component-common ---
[INFO] Using 'UTF-8' encoding to copy filtered resources.
[INFO] skip non existing resourceDirectory <http://jenkins.mw.lab.eng.bos.redhat.com/hudson/job/SwitchYard-Components/ws/common/common/src/main/resources>
[INFO] 
[INFO] --- maven-compiler-plugin:2.3.2:compile (default-compile) @ switchyard-component-common ---
[INFO] Compiling 20 source files to <http://jenkins.mw.lab.eng.bos.redhat.com/hudson/job/SwitchYard-Components/ws/common/common/target/classes>
[WARNING] <http://jenkins.mw.lab.eng.bos.redhat.com/hudson/job/SwitchYard-Components/ws/common/common/src/main/java/org/switchyard/component/common/CommonCommonMessages.java>:[3,24] [deprecation] org.jboss.logging.Cause in org.jboss.logging has been deprecated
[WARNING] <http://jenkins.mw.lab.eng.bos.redhat.com/hudson/job/SwitchYard-Components/ws/common/common/src/main/java/org/switchyard/component/common/CommonCommonMessages.java>:[45,65] [deprecation] org.jboss.logging.Cause in org.jboss.logging has been deprecated
[WARNING] <http://jenkins.mw.lab.eng.bos.redhat.com/hudson/job/SwitchYard-Components/ws/common/common/src/main/java/org/switchyard/component/common/CommonCommonMessages.java>:[85,75] [deprecation] org.jboss.logging.Cause in org.jboss.logging has been deprecated
[WARNING] <http://jenkins.mw.lab.eng.bos.redhat.com/hudson/job/SwitchYard-Components/ws/common/common/src/main/java/org/switchyard/component/common/CommonCommonMessages.java>:[100,56] [deprecation] org.jboss.logging.Cause in org.jboss.logging has been deprecated
[WARNING] <http://jenkins.mw.lab.eng.bos.redhat.com/hudson/job/SwitchYard-Components/ws/common/common/src/main/java/org/switchyard/component/common/CommonCommonMessages.java>:[3,24] [deprecation] org.jboss.logging.Cause in org.jboss.logging has been deprecated
[WARNING] <http://jenkins.mw.lab.eng.bos.redhat.com/hudson/job/SwitchYard-Components/ws/common/common/src/main/java/org/switchyard/component/common/CommonCommonMessages.java>:[45,65] [deprecation] org.jboss.logging.Cause in org.jboss.logging has been deprecated
[WARNING] <http://jenkins.mw.lab.eng.bos.redhat.com/hudson/job/SwitchYard-Components/ws/common/common/src/main/java/org/switchyard/component/common/CommonCommonMessages.java>:[85,75] [deprecation] org.jboss.logging.Cause in org.jboss.logging has been deprecated
[WARNING] <http://jenkins.mw.lab.eng.bos.redhat.com/hudson/job/SwitchYard-Components/ws/common/common/src/main/java/org/switchyard/component/common/CommonCommonMessages.java>:[100,56] [deprecation] org.jboss.logging.Cause in org.jboss.logging has been deprecated
[WARNING] <http://jenkins.mw.lab.eng.bos.redhat.com/hudson/job/SwitchYard-Components/ws/common/common/src/main/java/org/switchyard/component/common/CommonCommonMessages.java>:[3,24] [deprecation] org.jboss.logging.Cause in org.jboss.logging has been deprecated
[WARNING] <http://jenkins.mw.lab.eng.bos.redhat.com/hudson/job/SwitchYard-Components/ws/common/common/src/main/java/org/switchyard/component/common/CommonCommonMessages.java>:[45,65] [deprecation] org.jboss.logging.Cause in org.jboss.logging has been deprecated
[WARNING] <http://jenkins.mw.lab.eng.bos.redhat.com/hudson/job/SwitchYard-Components/ws/common/common/src/main/java/org/switchyard/component/common/CommonCommonMessages.java>:[85,75] [deprecation] org.jboss.logging.Cause in org.jboss.logging has been deprecated
[WARNING] <http://jenkins.mw.lab.eng.bos.redhat.com/hudson/job/SwitchYard-Components/ws/common/common/src/main/java/org/switchyard/component/common/CommonCommonMessages.java>:[100,56] [deprecation] org.jboss.logging.Cause in org.jboss.logging has been deprecated
[INFO] 
[INFO] --- maven-resources-plugin:2.4.3:testResources (default-testResources) @ switchyard-component-common ---
[INFO] Using 'UTF-8' encoding to copy filtered resources.
[INFO] skip non existing resourceDirectory <http://jenkins.mw.lab.eng.bos.redhat.com/hudson/job/SwitchYard-Components/ws/common/common/src/test/resources>
[INFO] 
[INFO] --- maven-compiler-plugin:2.3.2:testCompile (default-testCompile) @ switchyard-component-common ---
[INFO] Compiling 2 source files to <http://jenkins.mw.lab.eng.bos.redhat.com/hudson/job/SwitchYard-Components/ws/common/common/target/test-classes>
[INFO] 
[INFO] --- maven-surefire-plugin:2.6:test (default-test) @ switchyard-component-common ---
[INFO] Surefire report directory: <http://jenkins.mw.lab.eng.bos.redhat.com/hudson/job/SwitchYard-Components/ws/common/common/target/surefire-reports>

-------------------------------------------------------
 T E S T S
-------------------------------------------------------
Running org.switchyard.component.common.composer.RegexContextMapperTests
log4j:WARN No appenders could be found for logger (org.jboss.logging).
log4j:WARN Please initialize the log4j system properly.
log4j:WARN See http://logging.apache.org/log4j/1.2/faq.html#noconfig for more info.
Tests run: 12, Failures: 0, Errors: 0, Skipped: 0, Time elapsed: 0.481 sec
Running org.switchyard.component.common.selector.OperationSelectorTest
Tests run: 3, Failures: 0, Errors: 0, Skipped: 0, Time elapsed: 0.384 sec

Results :

Tests run: 15, Failures: 0, Errors: 0, Skipped: 0

[INFO] 
[INFO] --- maven-jar-plugin:2.3.1:jar (default-jar) @ switchyard-component-common ---
[INFO] Building jar: <http://jenkins.mw.lab.eng.bos.redhat.com/hudson/job/SwitchYard-Components/ws/common/common/target/switchyard-component-common-1.1.0.CR1.jar>
[INFO] 
[INFO] --- maven-source-plugin:2.1.1:jar-no-fork (attach-sources) @ switchyard-component-common ---
[INFO] Building jar: <http://jenkins.mw.lab.eng.bos.redhat.com/hudson/job/SwitchYard-Components/ws/common/common/target/switchyard-component-common-1.1.0.CR1-sources.jar>
[INFO] 
[INFO] --- maven-install-plugin:2.3.1:install (default-install) @ switchyard-component-common ---
[INFO] Installing <http://jenkins.mw.lab.eng.bos.redhat.com/hudson/job/SwitchYard-Components/ws/common/common/target/switchyard-component-common-1.1.0.CR1.jar> to /home/hudson/.m2/repository/org/switchyard/components/switchyard-component-common/1.1.0.CR1/switchyard-component-common-1.1.0.CR1.jar
[INFO] Installing <http://jenkins.mw.lab.eng.bos.redhat.com/hudson/job/SwitchYard-Components/ws/common/common/pom.xml> to /home/hudson/.m2/repository/org/switchyard/components/switchyard-component-common/1.1.0.CR1/switchyard-component-common-1.1.0.CR1.pom
[INFO] Installing <http://jenkins.mw.lab.eng.bos.redhat.com/hudson/job/SwitchYard-Components/ws/common/common/target/switchyard-component-common-1.1.0.CR1-sources.jar> to /home/hudson/.m2/repository/org/switchyard/components/switchyard-component-common/1.1.0.CR1/switchyard-component-common-1.1.0.CR1-sources.jar
[INFO] 
[INFO] --- maven-checkstyle-plugin:2.8:checkstyle (default-cli) @ switchyard-component-common ---
[INFO] 
[WARNING] Unable to locate Source XRef to link to - DISABLED
[INFO] 
[INFO] --- findbugs-maven-plugin:2.3.2:findbugs (default-cli) @ switchyard-component-common ---
[INFO] ****** FindBugsMojo execute *******
[INFO] canGenerate is true
[INFO] ****** FindBugsMojo executeFindbugs *******
[INFO] Temp File is <http://jenkins.mw.lab.eng.bos.redhat.com/hudson/job/SwitchYard-Components/ws/common/common/target/findbugsTemp.xml>
[INFO] Fork Value is true
     [java] Warnings generated: 3
[INFO] xmlOutput is true
[INFO]                                                                         
[INFO] ------------------------------------------------------------------------
[INFO] Building SwitchYard: Component Test Parent 1.1.0.CR1
[INFO] ------------------------------------------------------------------------
[INFO] 
[INFO] --- maven-clean-plugin:2.5:clean (default-clean) @ switchyard-component-test-parent ---
[INFO] 
[INFO] --- maven-source-plugin:2.1.1:jar-no-fork (attach-sources) @ switchyard-component-test-parent ---
[INFO] 
[INFO] --- maven-install-plugin:2.3.1:install (default-install) @ switchyard-component-test-parent ---
[INFO] Installing <http://jenkins.mw.lab.eng.bos.redhat.com/hudson/job/SwitchYard-Components/ws/test/pom.xml> to /home/hudson/.m2/repository/org/switchyard/components/switchyard-component-test-parent/1.1.0.CR1/switchyard-component-test-parent-1.1.0.CR1.pom
[INFO] 
[INFO] --- maven-checkstyle-plugin:2.8:checkstyle (default-cli) @ switchyard-component-test-parent ---
[INFO] 
[INFO] --- findbugs-maven-plugin:2.3.2:findbugs (default-cli) @ switchyard-component-test-parent ---
[INFO] ****** FindBugsMojo execute *******
[INFO] canGenerate is false
[INFO]                                                                         
[INFO] ------------------------------------------------------------------------
[INFO] Building SwitchYard: Naming Test MixIn 1.1.0.CR1
[INFO] ------------------------------------------------------------------------
[INFO] 
[INFO] --- maven-clean-plugin:2.5:clean (default-clean) @ switchyard-component-test-mixin-naming ---
[INFO] Deleting <http://jenkins.mw.lab.eng.bos.redhat.com/hudson/job/SwitchYard-Components/ws/test/mixins/naming/target>
[INFO] 
[INFO] --- maven-resources-plugin:2.4.3:resources (default-resources) @ switchyard-component-test-mixin-naming ---
[INFO] Using 'UTF-8' encoding to copy filtered resources.
[INFO] skip non existing resourceDirectory <http://jenkins.mw.lab.eng.bos.redhat.com/hudson/job/SwitchYard-Components/ws/test/mixins/naming/src/main/resources>
[INFO] 
[INFO] --- maven-compiler-plugin:2.3.2:compile (default-compile) @ switchyard-component-test-mixin-naming ---
[INFO] Compiling 1 source file to <http://jenkins.mw.lab.eng.bos.redhat.com/hudson/job/SwitchYard-Components/ws/test/mixins/naming/target/classes>
[INFO] 
[INFO] --- maven-resources-plugin:2.4.3:testResources (default-testResources) @ switchyard-component-test-mixin-naming ---
[INFO] Using 'UTF-8' encoding to copy filtered resources.
[INFO] Copying 2 resources
[INFO] 
[INFO] --- maven-compiler-plugin:2.3.2:testCompile (default-testCompile) @ switchyard-component-test-mixin-naming ---
[INFO] No sources to compile
[INFO] 
[INFO] --- maven-surefire-plugin:2.6:test (default-test) @ switchyard-component-test-mixin-naming ---
[INFO] Surefire report directory: <http://jenkins.mw.lab.eng.bos.redhat.com/hudson/job/SwitchYard-Components/ws/test/mixins/naming/target/surefire-reports>

-------------------------------------------------------
 T E S T S
-------------------------------------------------------
There are no tests to run.

Results :

Tests run: 0, Failures: 0, Errors: 0, Skipped: 0

[INFO] 
[INFO] --- maven-jar-plugin:2.3.1:jar (default-jar) @ switchyard-component-test-mixin-naming ---
[INFO] Building jar: <http://jenkins.mw.lab.eng.bos.redhat.com/hudson/job/SwitchYard-Components/ws/test/mixins/naming/target/switchyard-component-test-mixin-naming-1.1.0.CR1.jar>
[INFO] 
[INFO] --- maven-source-plugin:2.1.1:jar-no-fork (attach-sources) @ switchyard-component-test-mixin-naming ---
[INFO] Building jar: <http://jenkins.mw.lab.eng.bos.redhat.com/hudson/job/SwitchYard-Components/ws/test/mixins/naming/target/switchyard-component-test-mixin-naming-1.1.0.CR1-sources.jar>
[INFO] 
[INFO] --- maven-install-plugin:2.3.1:install (default-install) @ switchyard-component-test-mixin-naming ---
[INFO] Installing <http://jenkins.mw.lab.eng.bos.redhat.com/hudson/job/SwitchYard-Components/ws/test/mixins/naming/target/switchyard-component-test-mixin-naming-1.1.0.CR1.jar> to /home/hudson/.m2/repository/org/switchyard/components/switchyard-component-test-mixin-naming/1.1.0.CR1/switchyard-component-test-mixin-naming-1.1.0.CR1.jar
[INFO] Installing <http://jenkins.mw.lab.eng.bos.redhat.com/hudson/job/SwitchYard-Components/ws/test/mixins/naming/pom.xml> to /home/hudson/.m2/repository/org/switchyard/components/switchyard-component-test-mixin-naming/1.1.0.CR1/switchyard-component-test-mixin-naming-1.1.0.CR1.pom
[INFO] Installing <http://jenkins.mw.lab.eng.bos.redhat.com/hudson/job/SwitchYard-Components/ws/test/mixins/naming/target/switchyard-component-test-mixin-naming-1.1.0.CR1-sources.jar> to /home/hudson/.m2/repository/org/switchyard/components/switchyard-component-test-mixin-naming/1.1.0.CR1/switchyard-component-test-mixin-naming-1.1.0.CR1-sources.jar
[INFO] 
[INFO] --- maven-checkstyle-plugin:2.8:checkstyle (default-cli) @ switchyard-component-test-mixin-naming ---
[INFO] ------------------------------------------------------------------------
[INFO] Reactor Summary:
[INFO] 
[INFO] SwitchYard: Components ............................ SUCCESS [22.945s]
[INFO] SwitchYard: Common Component Libraries Parent ..... SUCCESS [1.213s]
[INFO] SwitchYard: Common Component Library .............. SUCCESS [1:01.241s]
[INFO] SwitchYard: Component Test Parent ................. SUCCESS [0.943s]
[INFO] SwitchYard: Naming Test MixIn ..................... FAILURE [8.162s]
[INFO] SwitchYard: CDI Test MixIn ........................ SKIPPED
[INFO] SwitchYard: Bean Component ........................ SKIPPED
[INFO] SwitchYard: Camel Component Common Library ........ SKIPPED
[INFO] SwitchYard: Knowledge Common Component Library .... SKIPPED
[INFO] SwitchYard: AMQP MixIn ............................ SKIPPED
[INFO] SwitchYard: ActiveMQ Test MixIn ................... SKIPPED
[INFO] SwitchYard: HornetQ Test MixIn .................... SKIPPED
[INFO] SwitchYard: HTTP Test MixIn ....................... SKIPPED
[INFO] SwitchYard: JCA Test MixIn ........................ SKIPPED
[INFO] SwitchYard: Smooks Test MixIn ..................... SKIPPED
[INFO] SwitchYard: SCA Component ......................... SKIPPED
[INFO] SwitchYard: Rules Component ....................... SKIPPED
[INFO] SwitchYard: BPM Component ......................... SKIPPED
[INFO] SwitchYard: RESTEasy Component .................... SKIPPED
[INFO] SwitchYard: SOAP Component ........................ SKIPPED
[INFO] SwitchYard: BPEL Component ........................ SKIPPED
[INFO] SwitchYard: Component Camel Parent ................ SKIPPED
[INFO] SwitchYard: Camel Component :: Camel Component .... SKIPPED
[INFO] SwitchYard: Camel Component :: Binding Test framework  SKIPPED
[INFO] SwitchYard: Camel Component :: Core Binding ....... SKIPPED
[INFO] SwitchYard: Camel Component :: SwitchYard component  SKIPPED
[INFO] SwitchYard: Camel Component :: JMS Binding ........ SKIPPED
[INFO] SwitchYard: Camel Component :: AMQP Binding ....... SKIPPED
[INFO] SwitchYard: Camel Component :: Atom Binding ....... SKIPPED
[INFO] SwitchYard: Camel Component :: File Binding ....... SKIPPED
[INFO] SwitchYard: Camel Component :: FTP Binding ........ SKIPPED
[INFO] SwitchYard: Camel Component :: JPA Binding ........ SKIPPED
[INFO] SwitchYard: Camel Component :: Mail Binding ....... SKIPPED
[INFO] SwitchYard: Camel Component :: Netty Binding ...... SKIPPED
[INFO] SwitchYard: Camel Component :: Quartz Binding ..... SKIPPED
[INFO] SwitchYard: Camel Component :: SQL Binding ........ SKIPPED
[INFO] SwitchYard: Clojure Component ..................... SKIPPED
[INFO] SwitchYard: HTTP Component ........................ SKIPPED
[INFO] SwitchYard: JCA Component ......................... SKIPPED
[INFO] SwitchYard: Components Forge Plugin ............... SKIPPED
[INFO] SwitchYard: Bean Component Forge Plugin ........... SKIPPED
[INFO] SwitchYard: Component Common Forge Plugin ......... SKIPPED
[INFO] SwitchYard: Camel Component Forge Plugin .......... SKIPPED
[INFO] SwitchYard: Clojure Component Forge Plugin ........ SKIPPED
[INFO] SwitchYard: SOAP Gateway Forge Plugin ............. SKIPPED
[INFO] SwitchYard: RESTEasy Gateway Forge Plugin ......... SKIPPED
[INFO] SwitchYard: Rules Component Forge Plugin .......... SKIPPED
[INFO] SwitchYard: BPM Component Forge Plugin ............ SKIPPED
[INFO] SwitchYard: HTTP Gateway Forge Plugin ............. SKIPPED
[INFO] SwitchYard: JCA Gateway Forge Plugin .............. SKIPPED
[INFO] SwitchYard: SCA Gateway Forge Plugin .............. SKIPPED
[INFO] SwitchYard: Component Integration Tests ........... SKIPPED
[INFO] ------------------------------------------------------------------------
[INFO] BUILD FAILURE
[INFO] ------------------------------------------------------------------------
[INFO] Total time: 1:46.761s
[INFO] Finished at: Mon Nov 11 19:53:29 EST 2013
[INFO] Final Memory: 76M/322M
[INFO] ------------------------------------------------------------------------
[ERROR] Failed to execute goal org.apache.maven.plugins:maven-checkstyle-plugin:2.8:checkstyle (default-cli) on project switchyard-component-test-mixin-naming: An error has occurred in Checkstyle report generation. Failed during checkstyle execution: Unable to find configuration file at location checkstyle/checkstyle.xml: Could not find resource 'checkstyle/checkstyle.xml'. -> [Help 1]
[ERROR] 
[ERROR] To see the full stack trace of the errors, re-run Maven with the -e switch.
[ERROR] Re-run Maven using the -X switch to enable full debug logging.
[ERROR] 
[ERROR] For more information about the errors and possible solutions, please read the following articles:
[ERROR] [Help 1] http://cwiki.apache.org/confluence/display/MAVEN/MojoExecutionException
[ERROR] 
[ERROR] After correcting the problems, you can resume the build with the command
[ERROR]   mvn <goals> -rf :switchyard-component-test-mixin-naming
Build step 'Invoke top-level Maven targets' marked build as failure
[CHECKSTYLE] Skipping publisher since build result is FAILURE
[FINDBUGS] Skipping publisher since build result is FAILURE


More information about the switchyard-dev mailing list