[switchyard-dev] Build failed in Jenkins: SwitchYard-Release #1432

ci-builds at redhat.com ci-builds at redhat.com
Sat Oct 25 13:57:21 EDT 2014


See <http://jenkins.mw.lab.eng.bos.redhat.com/hudson/job/SwitchYard-Release/1432/>

------------------------------------------
[...truncated 4210 lines...]
       
Downloaded: https://repository.jboss.org/nexus/content/groups/developer/org/switchyard/quickstarts/switchyard-jca-outbound-hornetq/2.0.0-SNAPSHOT/maven-metadata.xml (2 KB at 1.5 KB/sec)
Downloading: http://snapshots.jboss.org/maven2/org/switchyard/quickstarts/switchyard-camel-bus-cdi/2.0.0-SNAPSHOT/maven-metadata.xml
Downloading: https://repository.jboss.org/nexus/content/groups/public/org/switchyard/quickstarts/switchyard-camel-bus-cdi/2.0.0-SNAPSHOT/maven-metadata.xml
Downloading: https://repository.jboss.org/nexus/content/groups/developer/org/switchyard/quickstarts/switchyard-camel-bus-cdi/2.0.0-SNAPSHOT/maven-metadata.xml
Downloading: http://maven.repository.redhat.com/techpreview/all/org/switchyard/quickstarts/switchyard-camel-bus-cdi/2.0.0-SNAPSHOT/maven-metadata.xml
1018 B   
         
Downloading: https://repository.jboss.org/nexus/content/repositories/fs-releases/org/switchyard/quickstarts/switchyard-camel-bus-cdi/2.0.0-SNAPSHOT/maven-metadata.xml
         
         
Downloaded: http://snapshots.jboss.org/maven2/org/switchyard/quickstarts/switchyard-camel-bus-cdi/2.0.0-SNAPSHOT/maven-metadata.xml (1018 B at 3.1 KB/sec)
1018 B   
1018 B   1018 B   
                  
Downloaded: https://repository.jboss.org/nexus/content/groups/developer/org/switchyard/quickstarts/switchyard-camel-bus-cdi/2.0.0-SNAPSHOT/maven-metadata.xml (1018 B at 1.2 KB/sec)
                  
Downloaded: https://repository.jboss.org/nexus/content/groups/public/org/switchyard/quickstarts/switchyard-camel-bus-cdi/2.0.0-SNAPSHOT/maven-metadata.xml (1018 B at 1.2 KB/sec)
Downloading: http://snapshots.jboss.org/maven2/org/switchyard/quickstarts/demos/switchyard-demo-orders/2.0.0-SNAPSHOT/maven-metadata.xml
Downloading: http://maven.repository.redhat.com/techpreview/all/org/switchyard/quickstarts/demos/switchyard-demo-orders/2.0.0-SNAPSHOT/maven-metadata.xml
Downloading: https://repository.jboss.org/nexus/content/groups/public/org/switchyard/quickstarts/demos/switchyard-demo-orders/2.0.0-SNAPSHOT/maven-metadata.xml
Downloading: https://repository.jboss.org/nexus/content/groups/developer/org/switchyard/quickstarts/demos/switchyard-demo-orders/2.0.0-SNAPSHOT/maven-metadata.xml
1022 B            
         
Downloading: https://repository.jboss.org/nexus/content/repositories/fs-releases/org/switchyard/quickstarts/demos/switchyard-demo-orders/2.0.0-SNAPSHOT/maven-metadata.xml
         
Downloaded: http://snapshots.jboss.org/maven2/org/switchyard/quickstarts/demos/switchyard-demo-orders/2.0.0-SNAPSHOT/maven-metadata.xml (1022 B at 3.1 KB/sec)
         
1022 B   
1022 B   1022 B   
                  
Downloaded: https://repository.jboss.org/nexus/content/groups/public/org/switchyard/quickstarts/demos/switchyard-demo-orders/2.0.0-SNAPSHOT/maven-metadata.xml (1022 B at 1.5 KB/sec)
[WARNING] Checksum validation failed, expected c4b9b44c2e60ce4cf20f31e78aedb402b8bcdf08 but is 16345952180b54796a4b19e9f276959e210f44e5 for https://repository.jboss.org/nexus/content/groups/developer/org/switchyard/quickstarts/demos/switchyard-demo-orders/2.0.0-SNAPSHOT/maven-metadata.xml
1022 B            
[WARNING] Checksum validation failed, expected c4b9b44c2e60ce4cf20f31e78aedb402b8bcdf08 but is 16345952180b54796a4b19e9f276959e210f44e5 for https://repository.jboss.org/nexus/content/groups/developer/org/switchyard/quickstarts/demos/switchyard-demo-orders/2.0.0-SNAPSHOT/maven-metadata.xml
         
Downloaded: https://repository.jboss.org/nexus/content/groups/developer/org/switchyard/quickstarts/demos/switchyard-demo-orders/2.0.0-SNAPSHOT/maven-metadata.xml (1022 B at 1.1 KB/sec)
Downloading: https://repository.jboss.org/nexus/content/groups/public/org/switchyard/quickstarts/demos/switchyard-demo-policy-transaction/2.0.0-SNAPSHOT/maven-metadata.xml
Downloading: http://snapshots.jboss.org/maven2/org/switchyard/quickstarts/demos/switchyard-demo-policy-transaction/2.0.0-SNAPSHOT/maven-metadata.xml
Downloading: https://repository.jboss.org/nexus/content/groups/developer/org/switchyard/quickstarts/demos/switchyard-demo-policy-transaction/2.0.0-SNAPSHOT/maven-metadata.xml
Downloading: http://maven.repository.redhat.com/techpreview/all/org/switchyard/quickstarts/demos/switchyard-demo-policy-transaction/2.0.0-SNAPSHOT/maven-metadata.xml
2 KB     
       
Downloading: https://repository.jboss.org/nexus/content/repositories/fs-releases/org/switchyard/quickstarts/demos/switchyard-demo-policy-transaction/2.0.0-SNAPSHOT/maven-metadata.xml
       
Downloaded: http://snapshots.jboss.org/maven2/org/switchyard/quickstarts/demos/switchyard-demo-policy-transaction/2.0.0-SNAPSHOT/maven-metadata.xml (2 KB at 3.2 KB/sec)
2 KB   
       
2 KB   2 KB   
              
Downloaded: https://repository.jboss.org/nexus/content/groups/public/org/switchyard/quickstarts/demos/switchyard-demo-policy-transaction/2.0.0-SNAPSHOT/maven-metadata.xml (2 KB at 1.7 KB/sec)
              
Downloaded: https://repository.jboss.org/nexus/content/groups/developer/org/switchyard/quickstarts/demos/switchyard-demo-policy-transaction/2.0.0-SNAPSHOT/maven-metadata.xml (2 KB at 1.6 KB/sec)
Downloading: https://repository.jboss.org/nexus/content/groups/developer/org/switchyard/quickstarts/demos/switchyard-demo-helpdesk/2.0.0-SNAPSHOT/maven-metadata.xml
Downloading: http://snapshots.jboss.org/maven2/org/switchyard/quickstarts/demos/switchyard-demo-helpdesk/2.0.0-SNAPSHOT/maven-metadata.xml
Downloading: https://repository.jboss.org/nexus/content/groups/public/org/switchyard/quickstarts/demos/switchyard-demo-helpdesk/2.0.0-SNAPSHOT/maven-metadata.xml
Downloading: http://maven.repository.redhat.com/techpreview/all/org/switchyard/quickstarts/demos/switchyard-demo-helpdesk/2.0.0-SNAPSHOT/maven-metadata.xml
1 KB          
       
Downloading: https://repository.jboss.org/nexus/content/repositories/fs-releases/org/switchyard/quickstarts/demos/switchyard-demo-helpdesk/2.0.0-SNAPSHOT/maven-metadata.xml
       
Downloaded: http://snapshots.jboss.org/maven2/org/switchyard/quickstarts/demos/switchyard-demo-helpdesk/2.0.0-SNAPSHOT/maven-metadata.xml (1 KB at 3.1 KB/sec)
       
1 KB   
       
Downloaded: https://repository.jboss.org/nexus/content/groups/public/org/switchyard/quickstarts/demos/switchyard-demo-helpdesk/2.0.0-SNAPSHOT/maven-metadata.xml (1 KB at 1.7 KB/sec)
1 KB   
       
Downloaded: https://repository.jboss.org/nexus/content/groups/developer/org/switchyard/quickstarts/demos/switchyard-demo-helpdesk/2.0.0-SNAPSHOT/maven-metadata.xml (1 KB at 1.4 KB/sec)
Downloading: https://repository.jboss.org/nexus/content/groups/developer/org/switchyard/quickstarts/demos/switchyard-demo-library/2.0.0-SNAPSHOT/maven-metadata.xml
Downloading: http://snapshots.jboss.org/maven2/org/switchyard/quickstarts/demos/switchyard-demo-library/2.0.0-SNAPSHOT/maven-metadata.xml
Downloading: https://repository.jboss.org/nexus/content/groups/public/org/switchyard/quickstarts/demos/switchyard-demo-library/2.0.0-SNAPSHOT/maven-metadata.xml
Downloading: http://maven.repository.redhat.com/techpreview/all/org/switchyard/quickstarts/demos/switchyard-demo-library/2.0.0-SNAPSHOT/maven-metadata.xml
1019 B   
         
Downloading: https://repository.jboss.org/nexus/content/repositories/fs-releases/org/switchyard/quickstarts/demos/switchyard-demo-library/2.0.0-SNAPSHOT/maven-metadata.xml
         
Downloaded: http://snapshots.jboss.org/maven2/org/switchyard/quickstarts/demos/switchyard-demo-library/2.0.0-SNAPSHOT/maven-metadata.xml (1019 B at 3.0 KB/sec)
1019 B   
         
[WARNING] Checksum validation failed, expected 4857c9742d94af64752a62e719e2c2b14f0682ad but is 9ef65807d0cbfb50d21ab93580d62e89322d02b8 for https://repository.jboss.org/nexus/content/groups/developer/org/switchyard/quickstarts/demos/switchyard-demo-library/2.0.0-SNAPSHOT/maven-metadata.xml
1019 B   
1019 B   1019 B   
[WARNING] Checksum validation failed, expected 4857c9742d94af64752a62e719e2c2b14f0682ad but is 9ef65807d0cbfb50d21ab93580d62e89322d02b8 for https://repository.jboss.org/nexus/content/groups/developer/org/switchyard/quickstarts/demos/switchyard-demo-library/2.0.0-SNAPSHOT/maven-metadata.xml
                  
Downloaded: https://repository.jboss.org/nexus/content/groups/public/org/switchyard/quickstarts/demos/switchyard-demo-library/2.0.0-SNAPSHOT/maven-metadata.xml (1019 B at 1.4 KB/sec)
                  
Downloaded: https://repository.jboss.org/nexus/content/groups/developer/org/switchyard/quickstarts/demos/switchyard-demo-library/2.0.0-SNAPSHOT/maven-metadata.xml (1019 B at 1.4 KB/sec)
Downloading: http://snapshots.jboss.org/maven2/org/switchyard/quickstarts/demos/switchyard-demo-policy-security-basic/2.0.0-SNAPSHOT/maven-metadata.xml
Downloading: https://repository.jboss.org/nexus/content/groups/public/org/switchyard/quickstarts/demos/switchyard-demo-policy-security-basic/2.0.0-SNAPSHOT/maven-metadata.xml
Downloading: https://repository.jboss.org/nexus/content/groups/developer/org/switchyard/quickstarts/demos/switchyard-demo-policy-security-basic/2.0.0-SNAPSHOT/maven-metadata.xml
Downloading: http://maven.repository.redhat.com/techpreview/all/org/switchyard/quickstarts/demos/switchyard-demo-policy-security-basic/2.0.0-SNAPSHOT/maven-metadata.xml
2 KB              
       
Downloading: https://repository.jboss.org/nexus/content/repositories/fs-releases/org/switchyard/quickstarts/demos/switchyard-demo-policy-security-basic/2.0.0-SNAPSHOT/maven-metadata.xml
       
Downloaded: http://snapshots.jboss.org/maven2/org/switchyard/quickstarts/demos/switchyard-demo-policy-security-basic/2.0.0-SNAPSHOT/maven-metadata.xml (2 KB at 2.8 KB/sec)
       
2 KB   
2 KB   2 KB   
              
Downloaded: https://repository.jboss.org/nexus/content/groups/public/org/switchyard/quickstarts/demos/switchyard-demo-policy-security-basic/2.0.0-SNAPSHOT/maven-metadata.xml (2 KB at 1.4 KB/sec)
              
Downloaded: https://repository.jboss.org/nexus/content/groups/developer/org/switchyard/quickstarts/demos/switchyard-demo-policy-security-basic/2.0.0-SNAPSHOT/maven-metadata.xml (2 KB at 1.4 KB/sec)
Downloading: https://repository.jboss.org/nexus/content/groups/developer/org/switchyard/quickstarts/demos/switchyard-demo-security-propagation-basic/2.0.0-SNAPSHOT/maven-metadata.xml
Downloading: http://snapshots.jboss.org/maven2/org/switchyard/quickstarts/demos/switchyard-demo-security-propagation-basic/2.0.0-SNAPSHOT/maven-metadata.xml
Downloading: https://repository.jboss.org/nexus/content/groups/public/org/switchyard/quickstarts/demos/switchyard-demo-security-propagation-basic/2.0.0-SNAPSHOT/maven-metadata.xml
Downloading: http://maven.repository.redhat.com/techpreview/all/org/switchyard/quickstarts/demos/switchyard-demo-security-propagation-basic/2.0.0-SNAPSHOT/maven-metadata.xml
2 KB          
       
Downloading: https://repository.jboss.org/nexus/content/repositories/fs-releases/org/switchyard/quickstarts/demos/switchyard-demo-security-propagation-basic/2.0.0-SNAPSHOT/maven-metadata.xml
       
Downloaded: http://snapshots.jboss.org/maven2/org/switchyard/quickstarts/demos/switchyard-demo-security-propagation-basic/2.0.0-SNAPSHOT/maven-metadata.xml (2 KB at 3.1 KB/sec)
       
2 KB   
[WARNING] Checksum validation failed, expected f434e4b174ae654bc979f1ae9ff5126d281baa45 but is ce2e89340fb1fe13687c3c987de3259635038c5d for https://repository.jboss.org/nexus/content/groups/developer/org/switchyard/quickstarts/demos/switchyard-demo-security-propagation-basic/2.0.0-SNAPSHOT/maven-metadata.xml
2 KB   
       
Downloaded: https://repository.jboss.org/nexus/content/groups/developer/org/switchyard/quickstarts/demos/switchyard-demo-security-propagation-basic/2.0.0-SNAPSHOT/maven-metadata.xml (2 KB at 1.4 KB/sec)
2 KB   
       
Downloaded: https://repository.jboss.org/nexus/content/groups/public/org/switchyard/quickstarts/demos/switchyard-demo-security-propagation-basic/2.0.0-SNAPSHOT/maven-metadata.xml (2 KB at 1.1 KB/sec)
Downloading: https://repository.jboss.org/nexus/content/groups/developer/org/switchyard/quickstarts/demos/switchyard-demo-security-propagation/2.0.0-SNAPSHOT/maven-metadata.xml
Downloading: http://snapshots.jboss.org/maven2/org/switchyard/quickstarts/demos/switchyard-demo-security-propagation/2.0.0-SNAPSHOT/maven-metadata.xml
Downloading: https://repository.jboss.org/nexus/content/groups/public/org/switchyard/quickstarts/demos/switchyard-demo-security-propagation/2.0.0-SNAPSHOT/maven-metadata.xml
Downloading: http://maven.repository.redhat.com/techpreview/all/org/switchyard/quickstarts/demos/switchyard-demo-security-propagation/2.0.0-SNAPSHOT/maven-metadata.xml
647 B   
        
Downloading: https://repository.jboss.org/nexus/content/repositories/fs-releases/org/switchyard/quickstarts/demos/switchyard-demo-security-propagation/2.0.0-SNAPSHOT/maven-metadata.xml
        
Downloaded: http://snapshots.jboss.org/maven2/org/switchyard/quickstarts/demos/switchyard-demo-security-propagation/2.0.0-SNAPSHOT/maven-metadata.xml (647 B at 2.0 KB/sec)
        
647 B   
647 B   647 B   
                
Downloaded: https://repository.jboss.org/nexus/content/groups/public/org/switchyard/quickstarts/demos/switchyard-demo-security-propagation/2.0.0-SNAPSHOT/maven-metadata.xml (647 B at 1.0 KB/sec)
                
Downloaded: https://repository.jboss.org/nexus/content/groups/developer/org/switchyard/quickstarts/demos/switchyard-demo-security-propagation/2.0.0-SNAPSHOT/maven-metadata.xml (647 B at 1.0 KB/sec)
Downloading: https://repository.jboss.org/nexus/content/groups/public/org/switchyard/quickstarts/demos/switchyard-demo-policy-security-cert/2.0.0-SNAPSHOT/maven-metadata.xml
Downloading: https://repository.jboss.org/nexus/content/groups/developer/org/switchyard/quickstarts/demos/switchyard-demo-policy-security-cert/2.0.0-SNAPSHOT/maven-metadata.xml
Downloading: http://maven.repository.redhat.com/techpreview/all/org/switchyard/quickstarts/demos/switchyard-demo-policy-security-cert/2.0.0-SNAPSHOT/maven-metadata.xml
Downloading: http://snapshots.jboss.org/maven2/org/switchyard/quickstarts/demos/switchyard-demo-policy-security-cert/2.0.0-SNAPSHOT/maven-metadata.xml
2 KB            
       
Downloading: https://repository.jboss.org/nexus/content/repositories/fs-releases/org/switchyard/quickstarts/demos/switchyard-demo-policy-security-cert/2.0.0-SNAPSHOT/maven-metadata.xml
       
Downloaded: http://snapshots.jboss.org/maven2/org/switchyard/quickstarts/demos/switchyard-demo-policy-security-cert/2.0.0-SNAPSHOT/maven-metadata.xml (2 KB at 2.8 KB/sec)
       
2 KB   2 KB   
2 KB   2 KB   
              
Downloaded: https://repository.jboss.org/nexus/content/groups/public/org/switchyard/quickstarts/demos/switchyard-demo-policy-security-cert/2.0.0-SNAPSHOT/maven-metadata.xml (2 KB at 1.1 KB/sec)
[WARNING] Checksum validation failed, expected a1ff6303f10cc75a85d1b50a643749c6761a501c but is 19b1ef05c39bd66a7b7e6cc749c32680ea30bcfd for https://repository.jboss.org/nexus/content/groups/developer/org/switchyard/quickstarts/demos/switchyard-demo-policy-security-cert/2.0.0-SNAPSHOT/maven-metadata.xml
2 KB          
[WARNING] Checksum validation failed, expected a1ff6303f10cc75a85d1b50a643749c6761a501c but is 19b1ef05c39bd66a7b7e6cc749c32680ea30bcfd for https://repository.jboss.org/nexus/content/groups/developer/org/switchyard/quickstarts/demos/switchyard-demo-policy-security-cert/2.0.0-SNAPSHOT/maven-metadata.xml
       
Downloaded: https://repository.jboss.org/nexus/content/groups/developer/org/switchyard/quickstarts/demos/switchyard-demo-policy-security-cert/2.0.0-SNAPSHOT/maven-metadata.xml (2 KB at 0.9 KB/sec)
Downloading: https://repository.jboss.org/nexus/content/groups/developer/org/switchyard/quickstarts/demos/switchyard-demo-policy-security-saml/2.0.0-SNAPSHOT/maven-metadata.xml
Downloading: http://snapshots.jboss.org/maven2/org/switchyard/quickstarts/demos/switchyard-demo-policy-security-saml/2.0.0-SNAPSHOT/maven-metadata.xml
Downloading: http://maven.repository.redhat.com/techpreview/all/org/switchyard/quickstarts/demos/switchyard-demo-policy-security-saml/2.0.0-SNAPSHOT/maven-metadata.xml
Downloading: https://repository.jboss.org/nexus/content/groups/public/org/switchyard/quickstarts/demos/switchyard-demo-policy-security-saml/2.0.0-SNAPSHOT/maven-metadata.xml
2 KB   
       
Downloading: https://repository.jboss.org/nexus/content/repositories/fs-releases/org/switchyard/quickstarts/demos/switchyard-demo-policy-security-saml/2.0.0-SNAPSHOT/maven-metadata.xml
       
Downloaded: http://snapshots.jboss.org/maven2/org/switchyard/quickstarts/demos/switchyard-demo-policy-security-saml/2.0.0-SNAPSHOT/maven-metadata.xml (2 KB at 3.1 KB/sec)
       
2 KB   
       
Downloaded: https://repository.jboss.org/nexus/content/groups/public/org/switchyard/quickstarts/demos/switchyard-demo-policy-security-saml/2.0.0-SNAPSHOT/maven-metadata.xml (2 KB at 1.8 KB/sec)
2 KB   
       
Downloaded: https://repository.jboss.org/nexus/content/groups/developer/org/switchyard/quickstarts/demos/switchyard-demo-policy-security-saml/2.0.0-SNAPSHOT/maven-metadata.xml (2 KB at 1.6 KB/sec)
Downloading: https://repository.jboss.org/nexus/content/groups/developer/org/switchyard/quickstarts/demos/switchyard-demo-policy-security-wss-signencrypt/2.0.0-SNAPSHOT/maven-metadata.xml
Downloading: https://repository.jboss.org/nexus/content/groups/public/org/switchyard/quickstarts/demos/switchyard-demo-policy-security-wss-signencrypt/2.0.0-SNAPSHOT/maven-metadata.xml
Downloading: http://snapshots.jboss.org/maven2/org/switchyard/quickstarts/demos/switchyard-demo-policy-security-wss-signencrypt/2.0.0-SNAPSHOT/maven-metadata.xml
Downloading: http://maven.repository.redhat.com/techpreview/all/org/switchyard/quickstarts/demos/switchyard-demo-policy-security-wss-signencrypt/2.0.0-SNAPSHOT/maven-metadata.xml
2 KB   
       
Downloading: https://repository.jboss.org/nexus/content/repositories/fs-releases/org/switchyard/quickstarts/demos/switchyard-demo-policy-security-wss-signencrypt/2.0.0-SNAPSHOT/maven-metadata.xml
       
Downloaded: http://snapshots.jboss.org/maven2/org/switchyard/quickstarts/demos/switchyard-demo-policy-security-wss-signencrypt/2.0.0-SNAPSHOT/maven-metadata.xml (2 KB at 3.1 KB/sec)
       
2 KB   
2 KB   2 KB   
[WARNING] Checksum validation failed, expected e6c31fd04169b91c7d3c48f619367560aaacea71 but is ca5e524a5ffa8f6188b1872578e1667526923527 for https://repository.jboss.org/nexus/content/groups/developer/org/switchyard/quickstarts/demos/switchyard-demo-policy-security-wss-signencrypt/2.0.0-SNAPSHOT/maven-metadata.xml
              
Downloaded: https://repository.jboss.org/nexus/content/groups/public/org/switchyard/quickstarts/demos/switchyard-demo-policy-security-wss-signencrypt/2.0.0-SNAPSHOT/maven-metadata.xml (2 KB at 1.4 KB/sec)
2 KB          
       
Downloaded: https://repository.jboss.org/nexus/content/groups/developer/org/switchyard/quickstarts/demos/switchyard-demo-policy-security-wss-signencrypt/2.0.0-SNAPSHOT/maven-metadata.xml (2 KB at 1.1 KB/sec)
Downloading: https://repository.jboss.org/nexus/content/groups/public/org/switchyard/quickstarts/demos/switchyard-demo-policy-security-wss-username/2.0.0-SNAPSHOT/maven-metadata.xml
Downloading: http://maven.repository.redhat.com/techpreview/all/org/switchyard/quickstarts/demos/switchyard-demo-policy-security-wss-username/2.0.0-SNAPSHOT/maven-metadata.xml
Downloading: https://repository.jboss.org/nexus/content/groups/developer/org/switchyard/quickstarts/demos/switchyard-demo-policy-security-wss-username/2.0.0-SNAPSHOT/maven-metadata.xml
Downloading: http://snapshots.jboss.org/maven2/org/switchyard/quickstarts/demos/switchyard-demo-policy-security-wss-username/2.0.0-SNAPSHOT/maven-metadata.xml
2 KB   
       
Downloading: https://repository.jboss.org/nexus/content/repositories/fs-releases/org/switchyard/quickstarts/demos/switchyard-demo-policy-security-wss-username/2.0.0-SNAPSHOT/maven-metadata.xml
       
Downloaded: http://snapshots.jboss.org/maven2/org/switchyard/quickstarts/demos/switchyard-demo-policy-security-wss-username/2.0.0-SNAPSHOT/maven-metadata.xml (2 KB at 2.9 KB/sec)
       
2 KB   
2 KB   2 KB   
              
Downloaded: https://repository.jboss.org/nexus/content/groups/public/org/switchyard/quickstarts/demos/switchyard-demo-policy-security-wss-username/2.0.0-SNAPSHOT/maven-metadata.xml (2 KB at 1.8 KB/sec)
              
Downloaded: https://repository.jboss.org/nexus/content/groups/developer/org/switchyard/quickstarts/demos/switchyard-demo-policy-security-wss-username/2.0.0-SNAPSHOT/maven-metadata.xml (2 KB at 1.8 KB/sec)
[INFO] ------------------------------------------------------------------------
[INFO] Reactor Summary:
[INFO] 
[INFO] SwitchYard: Distribution .......................... SUCCESS [4.378s]
[INFO] SwitchYard: Release Distribution Tests Utilities .. SUCCESS [29.384s]
[INFO] SwitchYard: Distribution Artifacts ................ SUCCESS [0.720s]
[INFO] SwitchYard: Container Parent ...................... SUCCESS [0.068s]
[INFO] SwitchYard: AS7 Release Distribution Tests ........ FAILURE [1:08.738s]
[INFO] SwitchYard: AS7 Extension ......................... SKIPPED
[INFO] SwitchYard: AS7 Modules ........................... SKIPPED
[INFO] SwitchYard: AS7 Bundle ............................ SKIPPED
[INFO] SwitchYard: AS7 Standalone Parent ................. SKIPPED
[INFO] SwitchYard: AS7 Distribution ...................... SKIPPED
[INFO] SwitchYard: Karaf ................................. SKIPPED
[INFO] SwitchYard: Karaf Deployer ........................ SKIPPED
[INFO] SwitchYard: Karaf Commands ........................ SKIPPED
[INFO] SwitchYard: BPEL Component Bundle for Karaf ....... SKIPPED
[INFO] SwitchYard: Karaf Features ........................ SKIPPED
[INFO] SwitchYard: Karaf Tests ........................... SKIPPED
[INFO] SwitchYard: Tools Distribution .................... SKIPPED
[INFO] SwitchYard: RHQ Plugin ............................ SKIPPED
[INFO] SwitchYard: Installer ............................. SKIPPED
[INFO] ------------------------------------------------------------------------
[INFO] BUILD FAILURE
[INFO] ------------------------------------------------------------------------
[INFO] Total time: 1:55.878s
[INFO] Finished at: Sat Oct 25 13:57:20 EDT 2014
[INFO] Final Memory: 86M/315M
[INFO] ------------------------------------------------------------------------
[ERROR] Failed to execute goal on project switchyard-as7-tests: Could not resolve dependencies for project org.switchyard:switchyard-as7-tests:jar:2.0.0-SNAPSHOT: Failed to collect dependencies for [org.switchyard:switchyard-test:jar:2.0.0-SNAPSHOT (compile), org.switchyard:switchyard-remote:jar:2.0.0-SNAPSHOT (compile), org.switchyard.components:switchyard-component-bean:jar:2.0.0-SNAPSHOT (compile), org.switchyard.components:switchyard-component-jca:jar:2.0.0-SNAPSHOT (compile), org.switchyard.components:switchyard-component-soap:jar:2.0.0-SNAPSHOT (compile), org.switchyard.components:switchyard-component-test-mixin-hornetq:jar:2.0.0-SNAPSHOT (compile), org.switchyard.components:switchyard-component-test-mixin-http:jar:2.0.0-SNAPSHOT (compile), org.switchyard:switchyard-release-testutil:jar:2.0.0-SNAPSHOT (compile), org.jboss.arquillian.junit:arquillian-junit-container:jar:1.0.3.Final (compile), org.jboss.shrinkwrap.descriptors:shrinkwrap-descriptors-impl-javaee:jar:2.0.0-alpha-3 (compile), org.jboss.as:jboss-as-arquillian-common:jar:7.2.0.Final (compile), org.apache.activemq:activemq-broker:jar:5.8.0 (compile), org.apache.activemq:activemq-mqtt:jar:5.8.0 (compile), org.fusesource.mqtt-client:mqtt-client:jar:1.6 (compile), org.switchyard:switchyard-release-distribution:jar:2.0.0-SNAPSHOT (compile), org.jvnet.mock-javamail:mock-javamail:jar:1.9 (test), com.h2database:h2:jar:1.3.168 (provided), commons-codec:commons-codec:jar:1.4 (test), org.switchyard.quickstarts:switchyard-transform-json:jar:2.0.0-SNAPSHOT (test), org.switchyard.quickstarts:switchyard-transform-smooks:jar:2.0.0-SNAPSHOT (test), org.switchyard.quickstarts:switchyard-transform-jaxb:jar:2.0.0-SNAPSHOT (test), org.switchyard.quickstarts:switchyard-transform-xslt:jar:2.0.0-SNAPSHOT (test), org.switchyard.quickstarts:switchyard-transform-dozer:jar:2.0.0-SNAPSHOT (test), org.switchyard.quickstarts:switchyard-camel-service:jar:2.0.0-SNAPSHOT (test), org.switchyard.quickstarts:switchyard-bean-service:jar:2.0.0-SNAPSHOT (test), org.switchyard.quickstarts:switchyard-camel-binding:jar:2.0.0-SNAPSHOT (test), org.switchyard.quickstarts:switchyard-camel-cxf:jar:2.0.0-SNAPSHOT (test), org.switchyard.quickstarts:switchyard-camel-hl7:jar:2.0.0-SNAPSHOT (test), org.switchyard.quickstarts:switchyard-camel-jms-binding:jar:2.0.0-SNAPSHOT (test), org.switchyard.quickstarts:switchyard-camel-jpa-binding:jar:2.0.0-SNAPSHOT (test), org.switchyard.quickstarts:switchyard-camel-ftp-binding:jar:2.0.0-SNAPSHOT (test), org.switchyard.quickstarts:switchyard-camel-mail-binding:jar:2.0.0-SNAPSHOT (test), org.switchyard.quickstarts:switchyard-camel-mqtt-binding:jar:2.0.0-SNAPSHOT (test), org.switchyard.quickstarts:switchyard-camel-netty-binding:jar:2.0.0-SNAPSHOT (test), org.switchyard.quickstarts:switchyard-camel-quartz-binding:jar:2.0.0-SNAPSHOT (test), org.switchyard.quickstarts:switchyard-camel-rss-binding:jar:2.0.0-SNAPSHOT (test), org.switchyard.quickstarts:switchyard-camel-sap-binding:jar:2.0.0-SNAPSHOT (test), org.switchyard.quickstarts:switchyard-camel-saxon:jar:2.0.0-SNAPSHOT (test), org.switchyard.quickstarts:switchyard-camel-sql-binding:jar:2.0.0-SNAPSHOT (test), org.switchyard.quickstarts:switchyard-camel-soap-proxy:jar:2.0.0-SNAPSHOT (test), org.switchyard.quickstarts:switchyard-ear-deployment-ear-assembly:ear:2.0.0-SNAPSHOT (test), org.switchyard.quickstarts:switchyard-http-binding:jar:2.0.0-SNAPSHOT (test), org.switchyard.quickstarts:switchyard-remote-invoker:jar:2.0.0-SNAPSHOT (test), org.switchyard.quickstarts:switchyard-rest-binding:jar:2.0.0-SNAPSHOT (test), org.switchyard.quickstarts:switchyard-rules-camel-cbr:jar:2.0.0-SNAPSHOT (test), org.switchyard.quickstarts:switchyard-rules-interview:jar:2.0.0-SNAPSHOT (test), org.switchyard.quickstarts:switchyard-rules-interview-container:jar:2.0.0-SNAPSHOT (test), org.switchyard.quickstarts:switchyard-rules-interview-dtable:jar:2.0.0-SNAPSHOT (test), org.switchyard.quickstarts:switchyard-soap-addressing:jar:2.0.0-SNAPSHOT (test), org.switchyard.quickstarts:switchyard-soap-attachment:jar:2.0.0-SNAPSHOT (test), org.switchyard.quickstarts:switchyard-soap-binding-rpc:jar:2.0.0-SNAPSHOT (test), org.switchyard.quickstarts:switchyard-soap-mtom:jar:2.0.0-SNAPSHOT (test), org.switchyard.quickstarts:switchyard-bpm-service:jar:2.0.0-SNAPSHOT (test), org.switchyard.quickstarts:switchyard-bpel-say-hello:jar:2.0.0-SNAPSHOT (test), org.switchyard.quickstarts:switchyard-bpel-loan-approval:jar:2.0.0-SNAPSHOT (test), org.switchyard.quickstarts:switchyard-bpel-jms-binding:jar:2.0.0-SNAPSHOT (test), org.switchyard.quickstarts:switchyard-validate-xml:jar:2.0.0-SNAPSHOT (test), org.switchyard.quickstarts:switchyard-jca-inflow-hornetq:jar:2.0.0-SNAPSHOT (test), org.switchyard.quickstarts:switchyard-jca-outbound-hornetq:jar:2.0.0-SNAPSHOT (test), org.switchyard.quickstarts:switchyard-camel-bus-cdi:jar:2.0.0-SNAPSHOT (test), org.switchyard.quickstarts.demos:switchyard-demo-orders:war:2.0.0-SNAPSHOT (test), org.switchyard.quickstarts.demos:switchyard-demo-policy-transaction:jar:2.0.0-SNAPSHOT (test), org.switchyard.quickstarts.demos:switchyard-demo-helpdesk:war:2.0.0-SNAPSHOT (test), org.switchyard.quickstarts.demos:switchyard-demo-library:jar:2.0.0-SNAPSHOT (test), org.switchyard.quickstarts.demos:switchyard-demo-policy-security-basic:jar:2.0.0-SNAPSHOT (test), org.switchyard.quickstarts.demos:switchyard-demo-security-propagation-basic:jar:2.0.0-SNAPSHOT (test), org.switchyard.quickstarts.demos:switchyard-demo-policy-security-cert:jar:2.0.0-SNAPSHOT (test), org.switchyard.quickstarts.demos:switchyard-demo-policy-security-saml:jar:2.0.0-SNAPSHOT (test), org.switchyard.quickstarts.demos:switchyard-demo-policy-security-wss-signencrypt:jar:2.0.0-SNAPSHOT (test), org.switchyard.quickstarts.demos:switchyard-demo-policy-security-wss-username:jar:2.0.0-SNAPSHOT (test)]: Failed to read artifact descriptor for com.sap.conn.jco:sapjco3:jar:3.0.8: Could not transfer artifact com.sap.conn.jco:sapjco3:pom:3.0.8 from/to eclipse-juno (http://download.eclipse.org/releases/juno/): No connector available to access repository eclipse-juno (http://download.eclipse.org/releases/juno/) of type p2 using the available factories WagonRepositoryConnectorFactory -> [Help 1]
[ERROR] 
[ERROR] To see the full stack trace of the errors, re-run Maven with the -e switch.
[ERROR] Re-run Maven using the -X switch to enable full debug logging.
[ERROR] 
[ERROR] For more information about the errors and possible solutions, please read the following articles:
[ERROR] [Help 1] http://cwiki.apache.org/confluence/display/MAVEN/DependencyResolutionException
[ERROR] 
[ERROR] After correcting the problems, you can resume the build with the command
[ERROR]   mvn <goals> -rf :switchyard-as7-tests
Build step 'Invoke top-level Maven targets' marked build as failure
Archiving artifacts
Recording test results



More information about the switchyard-dev mailing list