[switchyard-dev] Build failed in Jenkins: SwitchYard-Release-WildFly #722

ci-builds at redhat.com ci-builds at redhat.com
Mon Jan 18 16:17:30 EST 2016


See <http://jenkins.mw.lab.eng.bos.redhat.com/hudson/job/SwitchYard-Release-WildFly/722/>

------------------------------------------
[...truncated 120628 lines...]
11007 KB   
11009 KB   
11011 KB   
11015 KB   
11017 KB   
11019 KB   
11023 KB   
11025 KB   
11027 KB   
11031 KB   
11033 KB   
11035 KB   
11039 KB   
11041 KB   
11043 KB   
11047 KB   
11048 KB   
11051 KB   
11055 KB   
11056 KB   
11059 KB   
11063 KB   
11064 KB   
11067 KB   
11071 KB   
11072 KB   
11075 KB   
11079 KB   
11080 KB   
11083 KB   
11087 KB   
11087 KB   
11091 KB   
11095 KB   
11095 KB   
11099 KB   
11103 KB   
11103 KB   
11107 KB   
11111 KB   
11111 KB   
11115 KB   
11119 KB   
11119 KB   
11123 KB   
11127 KB   
11131 KB   
11131 KB   
11134 KB   
11138 KB   
11139 KB   
11142 KB   
11146 KB   
11147 KB   
11150 KB   
11154 KB   
11155 KB   
11158 KB   
11162 KB   
11163 KB   
11166 KB   
11170 KB   
11171 KB   
11173 KB   
11177 KB   
11179 KB   
11181 KB   
11185 KB   
11187 KB   
11189 KB   
11193 KB   
11195 KB   
11197 KB   
11201 KB   
11203 KB   
11205 KB   
11209 KB   
11211 KB   
11212 KB   
11216 KB   
11219 KB   
11220 KB   
11224 KB   
11227 KB   
11228 KB   
11232 KB   
11235 KB   
11236 KB   
11240 KB   
11243 KB   
11244 KB   
11248 KB   
11251 KB   
11252 KB   
11256 KB   
11259 KB   
11259 KB   
11263 KB   
11267 KB   
11267 KB   
11271 KB   
11275 KB   
11275 KB   
11279 KB   
11283 KB   
11283 KB   
11287 KB   
11291 KB   
11291 KB   
11295 KB   
11298 KB   
11299 KB   
11303 KB   
11306 KB   
11307 KB   
11311 KB   
11314 KB   
11315 KB   
11319 KB   
11322 KB   
11323 KB   
11327 KB   
11330 KB   
11331 KB   
11335 KB   
11337 KB   
11339 KB   
11343 KB   
11345 KB   
11347 KB   
11351 KB   
11353 KB   
11355 KB   
11359 KB   
11361 KB   
11363 KB   
11367 KB   
11369 KB   
11371 KB   
11375 KB   
11377 KB   
11379 KB   
11383 KB   
11384 KB   
11387 KB   
11391 KB   
11392 KB   
11395 KB   
11399 KB   
11400 KB   
11403 KB   
11407 KB   
11408 KB   
11411 KB   
11415 KB   
11416 KB   
11419 KB   
11423 KB   
11423 KB   
11427 KB   
11430 KB   
           
Downloaded: https://repository.jboss.org/nexus/content/groups/developer/ca/uhn/hapi/hapi-osgi-base/2.1/hapi-osgi-base-2.1.jar (11430 KB at 2462.3 KB/sec)
Downloading: http://snapshots.jboss.org/maven2/org/fusesource/camel-sap/6.2.0.redhat-064/camel-sap-6.2.0.redhat-064.jar
           
Downloading: http://repository.jboss.org/maven2/org/fusesource/camel-sap/6.2.0.redhat-064/camel-sap-6.2.0.redhat-064.jar
           
Downloading: https://repository.jboss.org/nexus/content/groups/public/org/fusesource/camel-sap/6.2.0.redhat-064/camel-sap-6.2.0.redhat-064.jar
           
Downloading: https://repository.jboss.org/nexus/content/repositories/deprecated/org/fusesource/camel-sap/6.2.0.redhat-064/camel-sap-6.2.0.redhat-064.jar
           
Downloading: http://maven.repository.redhat.com/techpreview/all/org/fusesource/camel-sap/6.2.0.redhat-064/camel-sap-6.2.0.redhat-064.jar
           
Downloading: https://repository.jboss.org/nexus/content/repositories/fs-releases/org/fusesource/camel-sap/6.2.0.redhat-064/camel-sap-6.2.0.redhat-064.jar
           
Downloading: http://repo1.maven.org/maven2/org/fusesource/camel-sap/6.2.0.redhat-064/camel-sap-6.2.0.redhat-064.jar
           
[INFO] ------------------------------------------------------------------------
[INFO] Reactor Summary:
[INFO] 
[INFO] SwitchYard: Distribution .......................... SUCCESS [1:54.860s]
[INFO] SwitchYard: Release Distribution Tests Utilities .. SUCCESS [3:39.894s]
[INFO] SwitchYard: Distribution Artifacts ................ SUCCESS [1.672s]
[INFO] SwitchYard: Tools Distribution .................... SUCCESS [38.855s]
[INFO] SwitchYard: RHQ Plugin ............................ SUCCESS [41.158s]
[INFO] SwitchYard: Container Parent ...................... SUCCESS [54.935s]
[INFO] SwitchYard: AS7 Extension ......................... SUCCESS [5:14.257s]
[INFO] SwitchYard: AS7 Modules ........................... FAILURE [2:31.918s]
[INFO] SwitchYard: AS7 Bundle ............................ SKIPPED
[INFO] SwitchYard: Installer ............................. SKIPPED
[INFO] SwitchYard: AS7 Release Distribution Tests ........ SKIPPED
[INFO] SwitchYard: Wildfly Standalone Parent ............. SKIPPED
[INFO] SwitchYard: WildFly Extension ..................... SKIPPED
[INFO] SwitchYard: WildFly Modules ....................... SKIPPED
[INFO] SwitchYard: WildFly Bundle ........................ SKIPPED
[INFO] SwitchYard: WildFly Installer ..................... SKIPPED
[INFO] SwitchYard: Wildfly Distribution .................. SKIPPED
[INFO] ------------------------------------------------------------------------
[INFO] BUILD FAILURE
[INFO] ------------------------------------------------------------------------
[INFO] Total time: 16:44.252s
[INFO] Finished at: Mon Jan 18 16:17:20 EST 2016
[INFO] Final Memory: 138M/362M
[INFO] ------------------------------------------------------------------------
[ERROR] Failed to execute goal on project switchyard-as7-modules: Could not resolve dependencies for project org.switchyard:switchyard-as7-modules:jar:2.0.0.Final: Could not find artifact org.fusesource:camel-sap:jar:6.2.0.redhat-064 in jboss-deprecated (https://repository.jboss.org/nexus/content/repositories/deprecated/) -> [Help 1]
[ERROR] 
[ERROR] To see the full stack trace of the errors, re-run Maven with the -e switch.
[ERROR] Re-run Maven using the -X switch to enable full debug logging.
[ERROR] 
[ERROR] For more information about the errors and possible solutions, please read the following articles:
[ERROR] [Help 1] http://cwiki.apache.org/confluence/display/MAVEN/DependencyResolutionException
[ERROR] 
[ERROR] After correcting the problems, you can resume the build with the command
[ERROR]   mvn <goals> -rf :switchyard-as7-modules
Build step 'Invoke top-level Maven targets' marked build as failure
Archiving artifacts
Recording test results
ERROR: Publisher hudson.tasks.junit.JUnitResultArchiver aborted due to exception
hudson.AbortException: No test report files were found. Configuration error?
	at hudson.tasks.junit.JUnitParser$ParseResultCallable.invoke(JUnitParser.java:116)
	at hudson.tasks.junit.JUnitParser$ParseResultCallable.invoke(JUnitParser.java:93)
	at hudson.FilePath$FileCallableWrapper.call(FilePath.java:2589)
	at hudson.remoting.UserRequest.perform(UserRequest.java:121)
	at hudson.remoting.UserRequest.perform(UserRequest.java:49)
	at hudson.remoting.Request$2.run(Request.java:324)
	at hudson.remoting.InterceptingExecutorService$1.call(InterceptingExecutorService.java:68)
	at java.util.concurrent.FutureTask.run(FutureTask.java:262)
	at java.util.concurrent.ThreadPoolExecutor.runWorker(ThreadPoolExecutor.java:1145)
	at java.util.concurrent.ThreadPoolExecutor$Worker.run(ThreadPoolExecutor.java:615)
	at java.lang.Thread.run(Thread.java:745)
	at ......remote call to soavmg11-rhel6-x86(Native Method)
	at hudson.remoting.Channel.attachCallSiteStackTrace(Channel.java:1356)
	at hudson.remoting.UserResponse.retrieve(UserRequest.java:221)
	at hudson.remoting.Channel.call(Channel.java:752)
	at hudson.FilePath.act(FilePath.java:969)
	at hudson.FilePath.act(FilePath.java:958)
	at hudson.tasks.junit.JUnitParser.parseResult(JUnitParser.java:90)
	at hudson.tasks.junit.JUnitResultArchiver.parse(JUnitResultArchiver.java:120)
	at hudson.tasks.junit.JUnitResultArchiver.perform(JUnitResultArchiver.java:137)
	at hudson.tasks.BuildStepCompatibilityLayer.perform(BuildStepCompatibilityLayer.java:74)
	at hudson.tasks.BuildStepMonitor$1.perform(BuildStepMonitor.java:20)
	at hudson.model.AbstractBuild$AbstractBuildExecution.perform(AbstractBuild.java:770)
	at hudson.model.AbstractBuild$AbstractBuildExecution.performAllBuildSteps(AbstractBuild.java:734)
	at hudson.model.Build$BuildExecution.post2(Build.java:183)
	at hudson.model.AbstractBuild$AbstractBuildExecution.post(AbstractBuild.java:683)
	at hudson.model.Run.execute(Run.java:1770)
	at hudson.model.FreeStyleBuild.run(FreeStyleBuild.java:43)
	at hudson.model.ResourceController.execute(ResourceController.java:89)
	at hudson.model.Executor.run(Executor.java:240)


More information about the switchyard-dev mailing list