[teiid-designer-dev] Build failed in Jenkins: jbosstools-teiid-designer_trunk #2339 (master)

ci-builds at redhat.com ci-builds at redhat.com
Fri Jun 28 16:17:33 EDT 2013


See <http://jenkins.mw.lab.eng.bos.redhat.com/hudson/job/jbosstools-teiid-designer_trunk/2339/changes>

Changes:

[p.g.richardson] Updates parent pom to 4.1.0-CR1

[p.g.richardson] Stop the Server view from collapsing when a folder is clicked on

[p.g.richardson] Exception thrown by ModelExplorerResourceNavigator on exit

------------------------------------------
[...truncated 20406 lines...]

[INFO] All tests passed!
[INFO] 
[INFO] --- maven-install-plugin:2.3.1:install (default-install) @ org.teiid.designer.vdb.test ---
[INFO] Installing <http://jenkins.mw.lab.eng.bos.redhat.com/hudson/job/jbosstools-teiid-designer_trunk/ws/sources/tests/org.teiid.designer.vdb.test/target/org.teiid.designer.vdb.test-8.2.0-SNAPSHOT.jar> to <http://jenkins.mw.lab.eng.bos.redhat.com/hudson/job/jbosstools-teiid-designer_trunk/ws/.repository/org/jboss/tools/org.teiid.designer.vdb.test/8.2.0-SNAPSHOT/org.teiid.designer.vdb.test-8.2.0-SNAPSHOT.jar>
[INFO] Installing <http://jenkins.mw.lab.eng.bos.redhat.com/hudson/job/jbosstools-teiid-designer_trunk/ws/sources/tests/org.teiid.designer.vdb.test/pom.xml> to <http://jenkins.mw.lab.eng.bos.redhat.com/hudson/job/jbosstools-teiid-designer_trunk/ws/.repository/org/jboss/tools/org.teiid.designer.vdb.test/8.2.0-SNAPSHOT/org.teiid.designer.vdb.test-8.2.0-SNAPSHOT.pom>
[INFO] Installing <http://jenkins.mw.lab.eng.bos.redhat.com/hudson/job/jbosstools-teiid-designer_trunk/ws/sources/tests/org.teiid.designer.vdb.test/target/org.teiid.designer.vdb.test-8.2.0-SNAPSHOT-sources.jar> to <http://jenkins.mw.lab.eng.bos.redhat.com/hudson/job/jbosstools-teiid-designer_trunk/ws/.repository/org/jboss/tools/org.teiid.designer.vdb.test/8.2.0-SNAPSHOT/org.teiid.designer.vdb.test-8.2.0-SNAPSHOT-sources.jar>
[INFO] Installing <http://jenkins.mw.lab.eng.bos.redhat.com/hudson/job/jbosstools-teiid-designer_trunk/ws/sources/tests/org.teiid.designer.vdb.test/target/p2content.xml> to <http://jenkins.mw.lab.eng.bos.redhat.com/hudson/job/jbosstools-teiid-designer_trunk/ws/.repository/org/jboss/tools/org.teiid.designer.vdb.test/8.2.0-SNAPSHOT/org.teiid.designer.vdb.test-8.2.0-SNAPSHOT-p2metadata.xml>
[INFO] Installing <http://jenkins.mw.lab.eng.bos.redhat.com/hudson/job/jbosstools-teiid-designer_trunk/ws/sources/tests/org.teiid.designer.vdb.test/target/p2artifacts.xml> to <http://jenkins.mw.lab.eng.bos.redhat.com/hudson/job/jbosstools-teiid-designer_trunk/ws/.repository/org/jboss/tools/org.teiid.designer.vdb.test/8.2.0-SNAPSHOT/org.teiid.designer.vdb.test-8.2.0-SNAPSHOT-p2artifacts.xml>
[INFO] 
[INFO] --- tycho-p2-plugin:0.18.0:update-local-index (default-update-local-index) @ org.teiid.designer.vdb.test ---
[INFO]                                                                         
[INFO] ------------------------------------------------------------------------
[INFO] Skipping org.teiid.designer.test.feature
[INFO] This project has been banned from the build due to previous failures.
[INFO] ------------------------------------------------------------------------
[INFO]                                                                         
[INFO] ------------------------------------------------------------------------
[INFO] Building org.teiid.designer.runtime.feature 8.2.0-SNAPSHOT
[INFO] ------------------------------------------------------------------------
[INFO] 
[INFO] --- maven-clean-plugin:2.4.1:clean (default-clean) @ org.teiid.designer.runtime.feature ---
[INFO] Deleting <http://jenkins.mw.lab.eng.bos.redhat.com/hudson/job/jbosstools-teiid-designer_trunk/ws/sources/features/org.teiid.designer.runtime.feature/target>
[INFO] 
[INFO] --- tycho-packaging-plugin:0.18.0:build-qualifier-aggregator (default-build-qualifier-aggregator) @ org.teiid.designer.runtime.feature ---
[INFO] 
[INFO] --- tycho-packaging-plugin:0.18.0:validate-id (default-validate-id) @ org.teiid.designer.runtime.feature ---
[INFO] 
[INFO] --- tycho-packaging-plugin:0.18.0:validate-version (default-validate-version) @ org.teiid.designer.runtime.feature ---
[INFO] 
[INFO] --- jacoco-maven-plugin:0.6.1.201212231917:prepare-agent (default) @ org.teiid.designer.runtime.feature ---
[INFO] argLine set to -javaagent:<http://jenkins.mw.lab.eng.bos.redhat.com/hudson/job/jbosstools-teiid-designer_trunk/ws/.repository/org/jacoco/org.jacoco.agent/0.6.1.201212231917/org.jacoco.agent-0.6.1.201212231917-runtime.jar=destfile=/mnt/hudson_workspace/workspace/jbosstools-teiid-designer_trunk/sources/target/jacoco.exec,append=true,includes=org.jboss.tools.*>
[INFO] 
[INFO] --- tycho-source-plugin:0.18.0:plugin-source (plugin-source) @ org.teiid.designer.runtime.feature ---
[INFO] 
[INFO] --- tycho-packaging-plugin:0.18.0:package-feature (default-package-feature) @ org.teiid.designer.runtime.feature ---
[INFO] Building jar: <http://jenkins.mw.lab.eng.bos.redhat.com/hudson/job/jbosstools-teiid-designer_trunk/ws/sources/features/org.teiid.designer.runtime.feature/target/org.teiid.designer.runtime.feature-8.2.0-SNAPSHOT.jar>
[INFO] 
[INFO] --- tycho-p2-plugin:0.18.0:p2-metadata-default (default-p2-metadata-default) @ org.teiid.designer.runtime.feature ---
[INFO] 
[INFO] --- tycho-p2-plugin:0.18.0:feature-p2-metadata (default-feature-p2-metadata) @ org.teiid.designer.runtime.feature ---
[INFO] 
[INFO] --- repository-utils:0.16.0.CR2:generate-repository-facade (generate-facade) @ org.teiid.designer.runtime.feature ---
[INFO] 
[INFO] --- maven-install-plugin:2.3.1:install (default-install) @ org.teiid.designer.runtime.feature ---
[INFO] Installing <http://jenkins.mw.lab.eng.bos.redhat.com/hudson/job/jbosstools-teiid-designer_trunk/ws/sources/features/org.teiid.designer.runtime.feature/target/org.teiid.designer.runtime.feature-8.2.0-SNAPSHOT.jar> to <http://jenkins.mw.lab.eng.bos.redhat.com/hudson/job/jbosstools-teiid-designer_trunk/ws/.repository/org/jboss/tools/org.teiid.designer.runtime.feature/8.2.0-SNAPSHOT/org.teiid.designer.runtime.feature-8.2.0-SNAPSHOT.jar>
[INFO] Installing <http://jenkins.mw.lab.eng.bos.redhat.com/hudson/job/jbosstools-teiid-designer_trunk/ws/sources/features/org.teiid.designer.runtime.feature/pom.xml> to <http://jenkins.mw.lab.eng.bos.redhat.com/hudson/job/jbosstools-teiid-designer_trunk/ws/.repository/org/jboss/tools/org.teiid.designer.runtime.feature/8.2.0-SNAPSHOT/org.teiid.designer.runtime.feature-8.2.0-SNAPSHOT.pom>
[INFO] Installing <http://jenkins.mw.lab.eng.bos.redhat.com/hudson/job/jbosstools-teiid-designer_trunk/ws/sources/features/org.teiid.designer.runtime.feature/target/p2content.xml> to <http://jenkins.mw.lab.eng.bos.redhat.com/hudson/job/jbosstools-teiid-designer_trunk/ws/.repository/org/jboss/tools/org.teiid.designer.runtime.feature/8.2.0-SNAPSHOT/org.teiid.designer.runtime.feature-8.2.0-SNAPSHOT-p2metadata.xml>
[INFO] Installing <http://jenkins.mw.lab.eng.bos.redhat.com/hudson/job/jbosstools-teiid-designer_trunk/ws/sources/features/org.teiid.designer.runtime.feature/target/p2artifacts.xml> to <http://jenkins.mw.lab.eng.bos.redhat.com/hudson/job/jbosstools-teiid-designer_trunk/ws/.repository/org/jboss/tools/org.teiid.designer.runtime.feature/8.2.0-SNAPSHOT/org.teiid.designer.runtime.feature-8.2.0-SNAPSHOT-p2artifacts.xml>
[INFO] 
[INFO] --- tycho-p2-plugin:0.18.0:update-local-index (default-update-local-index) @ org.teiid.designer.runtime.feature ---
[INFO]                                                                         
[INFO] ------------------------------------------------------------------------
[INFO] Building Teiid Designer 8.2.0-SNAPSHOT
[INFO] ------------------------------------------------------------------------
[INFO] 
[INFO] --- maven-clean-plugin:2.4.1:clean (default-clean) @ teiid.site ---
[INFO] Deleting <http://jenkins.mw.lab.eng.bos.redhat.com/hudson/job/jbosstools-teiid-designer_trunk/ws/sources/site/target>
[INFO] 
[INFO] --- tycho-packaging-plugin:0.18.0:build-qualifier-aggregator (default-build-qualifier-aggregator) @ teiid.site ---
[INFO] 
[INFO] --- maven-clean-plugin:2.4.1:clean (default-clean-1) @ teiid.site ---
[INFO] 
[INFO] --- jacoco-maven-plugin:0.6.1.201212231917:prepare-agent (default) @ teiid.site ---
[INFO] argLine set to -javaagent:<http://jenkins.mw.lab.eng.bos.redhat.com/hudson/job/jbosstools-teiid-designer_trunk/ws/.repository/org/jacoco/org.jacoco.agent/0.6.1.201212231917/org.jacoco.agent-0.6.1.201212231917-runtime.jar=destfile=/mnt/hudson_workspace/workspace/jbosstools-teiid-designer_trunk/target/jacoco.exec,append=true,includes=org.jboss.tools.*>
[INFO] 
[INFO] --- tycho-source-plugin:0.18.0:plugin-source (plugin-source) @ teiid.site ---
[INFO] 
[INFO] --- tycho-p2-publisher-plugin:0.18.0:publish-products (default-publish-products) @ teiid.site ---
[INFO] 
[INFO] --- tycho-p2-publisher-plugin:0.18.0:publish-categories (default-publish-categories) @ teiid.site ---
[INFO] 
[INFO] --- tycho-p2-publisher-plugin:0.18.0:attach-artifacts (default-attach-artifacts) @ teiid.site ---
[INFO] 
[INFO] --- tycho-p2-repository-plugin:0.18.0:assemble-repository (default-assemble-repository) @ teiid.site ---
[INFO] 
[INFO] --- tycho-p2-repository-plugin:0.18.0:archive-repository (default-archive-repository) @ teiid.site ---
[INFO] Building zip: <http://jenkins.mw.lab.eng.bos.redhat.com/hudson/job/jbosstools-teiid-designer_trunk/ws/sources/site/target/teiid.site-8.2.0-SNAPSHOT.zip>
[INFO] 
[INFO] --- repository-utils:0.16.0.CR2:generate-repository-facade (generate-facade) @ teiid.site ---
[WARNING] No <http://jenkins.mw.lab.eng.bos.redhat.com/hudson/job/jbosstools-teiid-designer_trunk/ws/sources/site/target/repository/web/site.css> found; using default.
[WARNING] No org.jboss.tools.central.discovery plugin in repo. Skip generation of 'jbosstools-directory.xml'
[INFO] Building zip: <http://jenkins.mw.lab.eng.bos.redhat.com/hudson/job/jbosstools-teiid-designer_trunk/ws/sources/site/target/teiid.site-8.2.0-SNAPSHOT.zip>
[INFO] 
[INFO] --- maven-antrun-plugin:1.7:run (copy-site-to-site_assembly.zip) @ teiid.site ---
[INFO] Executing tasks

main:
     [copy] Copying 1 file to <http://jenkins.mw.lab.eng.bos.redhat.com/hudson/job/jbosstools-teiid-designer_trunk/ws/sources/site/target>
[INFO] Executed tasks
[INFO] 
[INFO] --- maven-install-plugin:2.3.1:install (default-install) @ teiid.site ---
[INFO] Installing <http://jenkins.mw.lab.eng.bos.redhat.com/hudson/job/jbosstools-teiid-designer_trunk/ws/sources/site/target/teiid.site-8.2.0-SNAPSHOT.zip> to <http://jenkins.mw.lab.eng.bos.redhat.com/hudson/job/jbosstools-teiid-designer_trunk/ws/.repository/org/jboss/tools/teiid.site/8.2.0-SNAPSHOT/teiid.site-8.2.0-SNAPSHOT.zip>
[INFO] Installing <http://jenkins.mw.lab.eng.bos.redhat.com/hudson/job/jbosstools-teiid-designer_trunk/ws/sources/site/pom.xml> to <http://jenkins.mw.lab.eng.bos.redhat.com/hudson/job/jbosstools-teiid-designer_trunk/ws/.repository/org/jboss/tools/teiid.site/8.2.0-SNAPSHOT/teiid.site-8.2.0-SNAPSHOT.pom>
[INFO] Installing <http://jenkins.mw.lab.eng.bos.redhat.com/hudson/job/jbosstools-teiid-designer_trunk/ws/sources/site/target/p2content.xml> to <http://jenkins.mw.lab.eng.bos.redhat.com/hudson/job/jbosstools-teiid-designer_trunk/ws/.repository/org/jboss/tools/teiid.site/8.2.0-SNAPSHOT/teiid.site-8.2.0-SNAPSHOT-p2metadata.xml>
[INFO] Installing <http://jenkins.mw.lab.eng.bos.redhat.com/hudson/job/jbosstools-teiid-designer_trunk/ws/sources/site/target/p2artifacts.xml> to <http://jenkins.mw.lab.eng.bos.redhat.com/hudson/job/jbosstools-teiid-designer_trunk/ws/.repository/org/jboss/tools/teiid.site/8.2.0-SNAPSHOT/teiid.site-8.2.0-SNAPSHOT-p2artifacts.xml>
[INFO] 
[INFO] --- tycho-p2-plugin:0.18.0:update-local-index (default-update-local-index) @ teiid.site ---
[INFO] ------------------------------------------------------------------------
[INFO] Reactor Summary:
[INFO] 
[INFO] teiid.all ......................................... SUCCESS [2.139s]
[INFO] Teiid Designer Target Platform .................... SUCCESS [0.239s]
[INFO] teiid.plugins ..................................... SUCCESS [0.033s]
[INFO] org.teiid.designer.spi ............................ SUCCESS [8.847s]
[INFO] org.teiid.datatools.connectivity.model ............ SUCCESS [1.403s]
[INFO] org.teiid.datatools.connectivity .................. SUCCESS [3.066s]
[INFO] org.teiid.datatools.connectivity.ui ............... SUCCESS [4.357s]
[INFO] teiid.plugins.teiid ............................... SUCCESS [0.071s]
[INFO] teiid runtime client 7.7.x ........................ SUCCESS [32.469s]
[INFO] teiid runtime client 8.3.x ........................ SUCCESS [28.749s]
[INFO] teiid runtime client 8.4.x ........................ SUCCESS [26.298s]
[INFO] org.teiid.core.designer ........................... SUCCESS [1.146s]
[INFO] org.teiid.designer ................................ SUCCESS [1.130s]
[INFO] org.teiid.designer.modeshape ...................... SUCCESS [2.296s]
[INFO] org.teiid.designer.legacy ......................... SUCCESS [9.712s]
[INFO] org.teiid.designer.metamodels.diagram ............. SUCCESS [1.244s]
[INFO] org.teiid.designer.metamodels.core ................ SUCCESS [2.577s]
[INFO] org.teiid.designer.metamodels.transformation ...... SUCCESS [4.033s]
[INFO] org.teiid.designer.extension ...................... SUCCESS [0.940s]
[INFO] org.teiid.designer.core ........................... SUCCESS [8.018s]
[INFO] org.teiid.designer.ui.common ...................... SUCCESS [5.514s]
[INFO] org.teiid.designer.compare ........................ SUCCESS [2.482s]
[INFO] org.teiid.designer.core.xslt ...................... SUCCESS [0.557s]
[INFO] org.teiid.designer.datatools ...................... SUCCESS [1.474s]
[INFO] org.teiid.designer.metamodels.relational .......... SUCCESS [3.388s]
[INFO] org.teiid.designer.ddl ............................ SUCCESS [2.003s]
[INFO] org.teiid.designer.jdbc ........................... SUCCESS [3.827s]
[INFO] org.teiid.designer.jdbc.relational ................ SUCCESS [1.322s]
[INFO] org.teiid.designer.metamodels.xsd ................. SUCCESS [2.110s]
[INFO] org.teiid.designer.metamodels.xml ................. SUCCESS [1.994s]
[INFO] org.teiid.designer.mapping ........................ SUCCESS [0.895s]
[INFO] org.teiid.designer.metamodels.function ............ SUCCESS [2.492s]
[INFO] org.teiid.designer.metamodels.webservice .......... SUCCESS [1.820s]
[INFO] org.teiid.designer.metamodels.wsdl ................ SUCCESS [3.204s]
[INFO] org.teiid.designer.relational ..................... SUCCESS [0.986s]
[INFO] org.teiid.designer.roles .......................... SUCCESS [0.665s]
[INFO] org.teiid.designer.xml ............................ SUCCESS [1.134s]
[INFO] org.teiid.designer.udf ............................ SUCCESS [1.780s]
[INFO] org.teiid.designer.transformation ................. SUCCESS [2.373s]
[INFO] org.teiid.designer.webservice ..................... SUCCESS [2.769s]
[INFO] org.teiid.designer.vdb ............................ SUCCESS [1.396s]
[INFO] org.teiid.designer.ui ............................. SUCCESS [14.733s]
[INFO] org.teiid.designer.compare.ui ..................... SUCCESS [2.384s]
[INFO] org.teiid.designer.schema.tools ................... SUCCESS [2.551s]
[INFO] org.teiid.designer.modelgenerator.xml ............. SUCCESS [4.170s]
[INFO] org.teiid.designer.modelgenerator.wsdl ............ SUCCESS [2.456s]
[INFO] org.teiid.designer.datatools.ui ................... SUCCESS [3.547s]
[INFO] org.teiid.designer.dqp ............................ SUCCESS [2.582s]
[INFO] org.teiid.designer.diagram.ui ..................... SUCCESS [8.958s]
[INFO] org.teiid.designer.roles.ui ....................... SUCCESS [2.566s]
[INFO] org.teiid.designer.vdb.ui ......................... SUCCESS [3.623s]
[INFO] org.teiid.designer.query.ui ....................... SUCCESS [3.416s]
[INFO] org.teiid.designer.tools.textimport.ui ............ SUCCESS [2.507s]
[INFO] org.teiid.designer.relational.ui .................. SUCCESS [7.336s]
[INFO] org.teiid.designer.transformation.ui .............. SUCCESS [14.572s]
[INFO] org.teiid.designer.jdbc.ui ........................ SUCCESS [5.821s]
[INFO] org.teiid.designer.sdt ............................ SUCCESS [2.212s]
[INFO] org.teiid.designer.dqp.ui ......................... SUCCESS [4.885s]
[INFO] org.teiid.designer.advisor.ui ..................... SUCCESS [4.808s]
[INFO] org.teiid.designer.ddl.spi ........................ SUCCESS [1.804s]
[INFO] org.teiid.designer.ddl.importer ................... SUCCESS [1.764s]
[INFO] org.teiid.designer.ddl.importer.ui ................ SUCCESS [4.273s]
[INFO] org.teiid.designer.extension.ui ................... SUCCESS [4.082s]
[INFO] org.teiid.designer.help ........................... SUCCESS [0.474s]
[INFO] org.teiid.designer.xsd ............................ SUCCESS [0.971s]
[INFO] org.teiid.designer.mapping.ui ..................... SUCCESS [4.761s]
[INFO] org.teiid.designer.metamodels.builder ............. SUCCESS [0.746s]
[INFO] org.teiid.designer.metamodels.builder.execution ... SUCCESS [0.901s]
[INFO] org.teiid.designer.metamodels.dependency .......... SUCCESS [2.186s]
[INFO] org.teiid.designer.metamodels.xsd.ui .............. SUCCESS [1.680s]
[INFO] org.teiid.designer.modelgenerator ................. SUCCESS [0.765s]
[INFO] org.teiid.designer.modelgenerator.salesforce ...... SUCCESS [2.781s]
[INFO] org.teiid.designer.modelgenerator.salesforce.ui ... SUCCESS [1.825s]
[INFO] org.teiid.designer.modelgenerator.ui .............. SUCCESS [0.863s]
[INFO] org.teiid.designer.xsd.ui ......................... SUCCESS [3.854s]
[INFO] org.teiid.designer.modelgenerator.wsdl.ui ......... SUCCESS [3.339s]
[INFO] org.teiid.designer.teiidimporter.ui ............... SUCCESS [2.609s]
[INFO] org.teiid.designer.udf.ui ......................... SUCCESS [1.580s]
[INFO] org.teiid.designer.xml.ui ......................... SUCCESS [2.343s]
[INFO] org.teiid.designer.webservice.ui .................. SUCCESS [4.208s]
[INFO] teiid.features .................................... SUCCESS [0.025s]
[INFO] org.teiid.datatools.connectivity.feature .......... SUCCESS [0.448s]
[INFO] org.teiid.designer.teiid.client.feature ........... SUCCESS [1.496s]
[INFO] org.teiid.designer.feature ........................ SUCCESS [0.645s]
[INFO] teiid.tests ....................................... SUCCESS [0.025s]
[INFO] org.teiid.7.7.x.test .............................. SUCCESS [32.563s]
[INFO] org.teiid.8.3.x.test .............................. SUCCESS [34.167s]
[INFO] org.teiid.8.4.x.test .............................. SUCCESS [32.270s]
[INFO] org.teiid.core.designer.test.framework ............ SUCCESS [0.803s]
[INFO] org.teiid.core.designer.test ...................... SUCCESS [24.103s]
[INFO] org.teiid.designer.compare.test ................... SUCCESS [23.166s]
[INFO] org.teiid.designer.core.test.framework ............ SUCCESS [2.002s]
[INFO] org.teiid.designer.core.test ...................... SUCCESS [1:53.627s]
[INFO] org.teiid.designer.core.xslt.test ................. SUCCESS [25.421s]
[INFO] org.teiid.designer.ddl.importer.test .............. SUCCESS [27.303s]
[INFO] org.teiid.designer.dqp.test ....................... SUCCESS [33.053s]
[INFO] org.teiid.designer.extension.test ................. SUCCESS [26.678s]
[INFO] org.teiid.designer.jdbc.test.framework ............ SUCCESS [0.970s]
[INFO] org.teiid.designer.jdbc.relational.test ........... SUCCESS [24.586s]
[INFO] org.teiid.designer.jdbc.test ...................... SUCCESS [21.561s]
[INFO] org.teiid.designer.mapping.ui.test ................ SUCCESS [32.430s]
[INFO] org.teiid.designer.metamodels.core.test ........... SUCCESS [20.800s]
[INFO] org.teiid.designer.metamodels.relational.test ..... SUCCESS [30.503s]
[INFO] org.teiid.designer.metamodels.transformation.test . SUCCESS [24.410s]
[INFO] org.teiid.designer.metamodels.wsdl.test ........... SUCCESS [30.059s]
[INFO] org.teiid.designer.metamodels.xml.test ............ SUCCESS [22.650s]
[INFO] org.teiid.designer.modelgenerator.salesforce.test . SUCCESS [25.483s]
[INFO] org.teiid.designer.modelgenerator.test ............ SUCCESS [22.460s]
[INFO] org.teiid.designer.modelgenerator.wsdl.test ....... SUCCESS [30.813s]
[INFO] org.teiid.designer.query.ui.test .................. SUCCESS [45.748s]
[INFO] org.teiid.designer.schema.tools.test .............. SUCCESS [34.265s]
[INFO] org.teiid.designer.sdt.test ....................... SUCCESS [25.705s]
[INFO] org.teiid.designer.test ........................... SUCCESS [1.018s]
[INFO] org.teiid.designer.transformation.test ............ SUCCESS [59.982s]
[INFO] org.teiid.designer.ui.common.test ................. SUCCESS [37.253s]
[INFO] org.teiid.designer.ui.test ........................ SUCCESS [32.109s]
[INFO] org.teiid.designer.webservice.test ................ SUCCESS [26.213s]
[INFO] org.teiid.designer.webservice.ui.test ............. FAILURE [20.499s]
[INFO] org.teiid.designer.xml.ui.test .................... FAILURE [16.802s]
[INFO] org.teiid.designer.xsd.ui.test .................... SUCCESS [30.635s]
[INFO] org.teiid.designer.vdb.test ....................... SUCCESS [31.267s]
[INFO] org.teiid.designer.test.feature ................... SKIPPED
[INFO] org.teiid.designer.runtime.feature ................ SUCCESS [0.801s]
[INFO] Teiid Designer .................................... SUCCESS [1:37.672s]
[INFO] ------------------------------------------------------------------------
[INFO] BUILD FAILURE
[INFO] ------------------------------------------------------------------------
[INFO] Total time: 32:04.429s
[INFO] Finished at: Fri Jun 28 16:16:54 EDT 2013
[INFO] Final Memory: 242M/730M
[INFO] ------------------------------------------------------------------------
[ERROR] Failed to execute goal org.eclipse.tycho:tycho-surefire-plugin:0.18.0:test (default-test) on project org.teiid.designer.webservice.ui.test: An unexpected error occured (return code 13). See log for details. -> [Help 1]
[ERROR] Failed to execute goal org.eclipse.tycho:tycho-surefire-plugin:0.18.0:test (default-test) on project org.teiid.designer.xml.ui.test: An unexpected error occured (return code 13). See log for details. -> [Help 1]
[ERROR] 
[ERROR] To see the full stack trace of the errors, re-run Maven with the -e switch.
[ERROR] Re-run Maven using the -X switch to enable full debug logging.
[ERROR] 
[ERROR] For more information about the errors and possible solutions, please read the following articles:
[ERROR] [Help 1] http://cwiki.apache.org/confluence/display/MAVEN/MojoFailureException
[ERROR] 
[ERROR] After correcting the problems, you can resume the build with the command
[ERROR]   mvn <goals> -rf :org.teiid.designer.webservice.ui.test
Build step 'Invoke top-level Maven targets' marked build as failure
Terminating xvnc.
$ vncserver -kill :21
Killing Xvnc process ID 29565
Archiving artifacts
Recording test results


More information about the teiid-designer-dev mailing list