See <
http://10.8.63.16/job/Fuse-Tooling-pullrequest/568/>
------------------------------------------
[...truncated 5871 lines...]
[INFO] No tests to run.
[INFO]
[INFO] --- tycho-source-plugin:0.26.0:plugin-source (plugin-source) @ tests ---
[INFO]
[INFO] --- tycho-source-feature-plugin:0.26.0:source-feature (source-feature) @ tests ---
[INFO]
[INFO] --- tycho-p2-plugin:0.26.0:p2-metadata (attached-p2-metadata) @ tests ---
[INFO]
[INFO] --- repository-utils:0.25.0-SNAPSHOT:generate-repository-facade (generate-facade) @
tests ---
[INFO]
[INFO] --- tycho-p2-extras-plugin:0.26.0:compare-version-with-baselines (default) @ tests
---
[INFO]
[INFO] ------------------------------------------------------------------------
[INFO] Building JBoss Fuse Tooling :: Server Adapters :: Tests :: Karaf Core Tests
9.1.0-SNAPSHOT
[INFO] ------------------------------------------------------------------------
[INFO]
[INFO] --- maven-clean-plugin:3.0.0:clean (default-clean) @
org.fusesource.ide.server.karaf.core.tests ---
[INFO]
[INFO] --- tycho-packaging-plugin:0.26.0:build-qualifier (default-build-qualifier) @
org.fusesource.ide.server.karaf.core.tests ---
[INFO] The project's OSGi version is 9.1.0.Alpha3-v20161115-1717
[INFO]
[INFO] --- tycho-packaging-plugin:0.26.0:validate-id (default-validate-id) @
org.fusesource.ide.server.karaf.core.tests ---
[INFO]
[INFO] --- tycho-packaging-plugin:0.26.0:validate-version (default-validate-version) @
org.fusesource.ide.server.karaf.core.tests ---
[INFO]
[INFO] --- build-helper-maven-plugin:1.7:regex-property (regex-property) @
org.fusesource.ide.server.karaf.core.tests ---
[INFO] Setting property 'skipTestsOrITests' to ''.
[INFO]
[INFO] --- jacoco-maven-plugin:0.7.1.201405082137:prepare-agent (default) @
org.fusesource.ide.server.karaf.core.tests ---
[INFO] argLine set to
-javaagent:/home/jenkins/.m2/repository/org/jacoco/org.jacoco.agent/0.7.1.201405082137/org.jacoco.agent-0.7.1.201405082137-runtime.jar=destfile=<http://10.8.63.16/job/Fuse-Tooling-pullrequest/ws/servers/target/jacoco.exec,append=true,includes=org.jboss.tools.*>
[INFO]
[INFO] --- maven-resources-plugin:2.7:resources (default-resources) @
org.fusesource.ide.server.karaf.core.tests ---
[INFO] Using 'UTF-8' encoding to copy filtered resources.
[INFO] skip non existing resourceDirectory
<
http://10.8.63.16/job/Fuse-Tooling-pullrequest/ws/servers/tests/org.fuses...
[INFO]
[INFO] --- tycho-compiler-plugin:0.26.0:compile (default-compile) @
org.fusesource.ide.server.karaf.core.tests ---
[INFO]
[INFO] --- maven-resources-plugin:2.7:testResources (default-testResources) @
org.fusesource.ide.server.karaf.core.tests ---
[INFO] Using 'UTF-8' encoding to copy filtered resources.
[INFO] skip non existing resourceDirectory
<
http://10.8.63.16/job/Fuse-Tooling-pullrequest/ws/servers/tests/org.fuses...
[INFO]
[INFO] --- maven-compiler-plugin:3.5.1:testCompile (compiletests) @
org.fusesource.ide.server.karaf.core.tests ---
[INFO] Changes detected - recompiling the module!
[INFO] Compiling 2 source files to
<
http://10.8.63.16/job/Fuse-Tooling-pullrequest/ws/servers/tests/org.fuses...
[INFO]
[INFO] --- maven-surefire-plugin:2.19.1:test (test) @
org.fusesource.ide.server.karaf.core.tests ---
-------------------------------------------------------
T E S T S
-------------------------------------------------------
Running org.fusesource.ide.server.karaf.core.server.subsystems.KarafUtilsTest
Tests run: 14, Failures: 0, Errors: 0, Skipped: 0, Time elapsed: 0.044 sec - in
org.fusesource.ide.server.karaf.core.server.subsystems.KarafUtilsTest
Running
org.fusesource.ide.server.karaf.core.server.subsystems.Karaf2xStartupLaunchConfiguratorTest
Tests run: 1, Failures: 0, Errors: 0, Skipped: 0, Time elapsed: 0.275 sec - in
org.fusesource.ide.server.karaf.core.server.subsystems.Karaf2xStartupLaunchConfiguratorTest
Results :
Tests run: 15, Failures: 0, Errors: 0, Skipped: 0
[INFO]
[INFO] --- tycho-source-plugin:0.26.0:plugin-source (plugin-source) @
org.fusesource.ide.server.karaf.core.tests ---
[INFO]
[INFO] --- target-platform-configuration:0.26.0:target-platform (default-target-platform)
@ org.fusesource.ide.server.karaf.core.tests ---
[INFO]
[INFO] --- tycho-packaging-plugin:0.26.0:package-plugin (default-package-plugin) @
org.fusesource.ide.server.karaf.core.tests ---
[INFO] Building jar:
<
http://10.8.63.16/job/Fuse-Tooling-pullrequest/ws/servers/tests/org.fuses...
[INFO]
[INFO] --- tycho-p2-plugin:0.26.0:p2-metadata-default (default-p2-metadata-default) @
org.fusesource.ide.server.karaf.core.tests ---
[INFO]
[INFO] --- tycho-source-feature-plugin:0.26.0:source-feature (source-feature) @
org.fusesource.ide.server.karaf.core.tests ---
[INFO]
[INFO] --- tycho-p2-plugin:0.26.0:p2-metadata (attached-p2-metadata) @
org.fusesource.ide.server.karaf.core.tests ---
[INFO]
[INFO] --- repository-utils:0.25.0-SNAPSHOT:generate-repository-facade (generate-facade) @
org.fusesource.ide.server.karaf.core.tests ---
[INFO]
[INFO] --- tycho-p2-extras-plugin:0.26.0:compare-version-with-baselines (default) @
org.fusesource.ide.server.karaf.core.tests ---
[INFO]
[INFO] ------------------------------------------------------------------------
[INFO] Building JBoss Fuse Tooling :: Server Adapters :: Tests :: Server Tests
9.1.0-SNAPSHOT
[INFO] ------------------------------------------------------------------------
[INFO]
[INFO] --- maven-clean-plugin:3.0.0:clean (default-clean) @
org.fusesource.ide.server.tests ---
[INFO]
[INFO] --- tycho-packaging-plugin:0.26.0:build-qualifier (default-build-qualifier) @
org.fusesource.ide.server.tests ---
[INFO] The project's OSGi version is 9.1.0.Alpha3-v20161115-1717
[INFO]
[INFO] --- tycho-packaging-plugin:0.26.0:validate-id (default-validate-id) @
org.fusesource.ide.server.tests ---
[INFO]
[INFO] --- tycho-packaging-plugin:0.26.0:validate-version (default-validate-version) @
org.fusesource.ide.server.tests ---
[INFO]
[INFO] --- build-helper-maven-plugin:1.7:regex-property (regex-property) @
org.fusesource.ide.server.tests ---
[INFO] Setting property 'skipTestsOrITests' to ''.
[INFO]
[INFO] --- jacoco-maven-plugin:0.7.1.201405082137:prepare-agent (default) @
org.fusesource.ide.server.tests ---
[INFO] tycho.testArgLine set to
-javaagent:/home/jenkins/.m2/repository/org/jacoco/org.jacoco.agent/0.7.1.201405082137/org.jacoco.agent-0.7.1.201405082137-runtime.jar=destfile=<http://10.8.63.16/job/Fuse-Tooling-pullrequest/ws/servers/target/jacoco.exec,append=true,includes=org.jboss.tools.*>
[INFO]
[INFO] --- maven-resources-plugin:2.7:resources (default-resources) @
org.fusesource.ide.server.tests ---
[INFO] Using 'UTF-8' encoding to copy filtered resources.
[INFO] skip non existing resourceDirectory
<
http://10.8.63.16/job/Fuse-Tooling-pullrequest/ws/servers/tests/org.fuses...
[INFO]
[INFO] --- tycho-compiler-plugin:0.26.0:compile (default-compile) @
org.fusesource.ide.server.tests ---
[INFO] Compiling 12 source files to
<
http://10.8.63.16/job/Fuse-Tooling-pullrequest/ws/servers/tests/org.fuses...
[INFO]
[INFO] --- maven-resources-plugin:2.7:testResources (default-testResources) @
org.fusesource.ide.server.tests ---
[INFO] Using 'UTF-8' encoding to copy filtered resources.
[INFO] skip non existing resourceDirectory
<
http://10.8.63.16/job/Fuse-Tooling-pullrequest/ws/servers/tests/org.fuses...
[INFO]
[INFO] --- maven-compiler-plugin:3.5.1:testCompile (compiletests) @
org.fusesource.ide.server.tests ---
[INFO] No sources to compile
[INFO]
[INFO] --- maven-surefire-plugin:2.19.1:test (test) @ org.fusesource.ide.server.tests ---
[INFO] No tests to run.
[INFO]
[INFO] --- tycho-source-plugin:0.26.0:plugin-source (plugin-source) @
org.fusesource.ide.server.tests ---
[INFO] Building jar:
<
http://10.8.63.16/job/Fuse-Tooling-pullrequest/ws/servers/tests/org.fuses...
[INFO]
[INFO] --- target-platform-configuration:0.26.0:target-platform (default-target-platform)
@ org.fusesource.ide.server.tests ---
[INFO]
[INFO] --- tycho-packaging-plugin:0.26.0:package-plugin (default-package-plugin) @
org.fusesource.ide.server.tests ---
[INFO] Building jar:
<
http://10.8.63.16/job/Fuse-Tooling-pullrequest/ws/servers/tests/org.fuses...
[INFO]
[INFO] --- tycho-p2-plugin:0.26.0:p2-metadata-default (default-p2-metadata-default) @
org.fusesource.ide.server.tests ---
[INFO]
[INFO] --- tycho-source-feature-plugin:0.26.0:source-feature (source-feature) @
org.fusesource.ide.server.tests ---
[INFO]
[INFO] --- tycho-p2-plugin:0.26.0:p2-metadata (attached-p2-metadata) @
org.fusesource.ide.server.tests ---
[INFO]
[INFO] --- repository-utils:0.25.0-SNAPSHOT:generate-repository-facade (generate-facade) @
org.fusesource.ide.server.tests ---
[INFO]
[INFO] --- tycho-surefire-plugin:0.26.0:test (default-test) @
org.fusesource.ide.server.tests ---
[INFO] Expected eclipse log file:
<
http://10.8.63.16/job/Fuse-Tooling-pullrequest/ws/servers/tests/org.fuses...
sp(a)xn--c/-bja.metadata/.log
[INFO] Command line:
[/usr/lib/jvm/java-1.8.0-openjdk-1.8.0.111-2.b15.el7_3.x86_64/jre/bin/java,
-Dosgi.noShutdown=false, -Dosgi.os=linux, -Dosgi.ws=gtk, -Dosgi.arch=x86_64,
-javaagent:/home/jenkins/.m2/repository/org/jacoco/org.jacoco.agent/0.7.1.201405082137/org.jacoco.agent-0.7.1.201405082137-runtime.jar=destfile=<http://10.8.63.16/job/Fuse-Tooling-pullrequest/ws/servers/target/jacoco.exec,append=true,includes=org.jboss.tools.*,>
-XX:+HeapDumpOnOutOfMemoryError, -Dusage_reporting_enabled=false,
-Dorg.jboss.tools.vpe.loadxulrunner=false, -Dosgi.clean=true, -jar,
/home/jenkins/.m2/repository/p2/osgi/bundle/org.eclipse.equinox.launcher/1.3.200.v20160318-1642/org.eclipse.equinox.launcher-1.3.200.v20160318-1642.jar,
-data,
<
http://10.8.63.16/job/Fuse-Tooling-pullrequest/ws/servers/tests/org.fuses...
sp@cé, -install,
<
http://10.8.63.16/job/Fuse-Tooling-pullrequest/ws/servers/tests/org.fuses...
-configuration,
<
http://10.8.63.16/job/Fuse-Tooling-pullrequest/ws/servers/tests/org.fuses...
-application, org.eclipse.tycho.surefire.osgibooter.uitest, -testproperties,
<
http://10.8.63.16/job/Fuse-Tooling-pullrequest/ws/servers/tests/org.fuses...
[ERROR] Timeout 2400 s exceeded. Process was killed.
[INFO] ------------------------------------------------------------------------
[INFO] Reactor Summary:
[INFO]
[INFO] JBoss Fuse Tooling :: Build Configuration .......... SUCCESS [ 0.282 s]
[INFO] JBoss Fuse Tooling ................................. SUCCESS [ 0.245 s]
[INFO] JBoss Fuse Tooling :: Tools ........................ SUCCESS [ 0.008 s]
[INFO] JBoss Fuse Tooling :: Tools :: IDE Build Tools ..... SUCCESS [ 0.752 s]
[INFO] JBoss Fuse Tooling :: Tools :: IDE Code Generator .. SUCCESS [ 0.392 s]
[INFO] JBoss Fuse Tooling :: Core ......................... SUCCESS [ 0.006 s]
[INFO] JBoss Fuse Tooling :: Core :: Plugins .............. SUCCESS [ 0.006 s]
[INFO] JBoss Fuse Tooling :: Core :: Plugins :: Foundation Core SUCCESS [ 14.937 s]
[INFO] JBoss Fuse Tooling :: Core :: Plugins :: Preferences SUCCESS [ 0.145 s]
[INFO] JBoss Fuse Tooling :: Core :: Plugins :: Foundation UI SUCCESS [ 0.848 s]
[INFO] JBoss Fuse Tooling :: Core :: Plugins :: Camel Model Service API SUCCESS [ 0.667
s]
[INFO] JBoss Fuse Tooling :: Core :: Plugins :: Camel 2.15.1.redhat-621084 Service
Implementation SUCCESS [ 0.436 s]
[INFO] JBoss Fuse Tooling :: Core :: Plugins :: Camel 2.15.1.redhat-621117 Service
Implementation SUCCESS [ 0.426 s]
[INFO] JBoss Fuse Tooling :: Core :: Plugins :: Camel 2.17.0.redhat-630187 Service
Implementation SUCCESS [ 0.514 s]
[INFO] JBoss Fuse Tooling :: Core :: Plugins :: Camel 2.17.3 Service Implementation
SUCCESS [ 0.510 s]
[INFO] JBoss Fuse Tooling :: Core :: Plugins :: Maven ..... SUCCESS [ 0.205 s]
[INFO] JBoss Fuse Tooling :: Camel Editor ................. SUCCESS [ 0.007 s]
[INFO] JBoss Fuse Tooling :: Camel Editor :: Plugins ...... SUCCESS [ 0.005 s]
[INFO] JBoss Fuse Tooling :: Camel Editor :: Plugins :: Branding SUCCESS [ 0.526 s]
[INFO] JBoss Fuse Tooling :: Core :: Plugins :: Camel Validation SUCCESS [ 0.292 s]
[INFO] JBoss Fuse Tooling :: Core :: Plugins :: Cheat Sheets SUCCESS [ 0.034 s]
[INFO] JBoss Fuse Tooling :: Core :: Plugins :: Graph ..... SUCCESS [ 0.227 s]
[INFO] JBoss Fuse Tooling :: Core :: Plugins :: Help ...... SUCCESS [ 0.899 s]
[INFO] JBoss Fuse Tooling :: Core :: Plugins :: Imports ... SUCCESS [ 0.214 s]
[INFO] JBoss Fuse Tooling :: Core :: Plugins :: Branding .. SUCCESS [ 0.035 s]
[INFO] JBoss Fuse Tooling :: Core :: Tests ................ SUCCESS [ 0.005 s]
[INFO] JBoss Fuse Tooling :: Core :: Tests :: Camel Service Core Tests SUCCESS [ 2.008
s]
[INFO] JBoss Fuse Tooling :: JMX .......................... SUCCESS [ 0.005 s]
[INFO] JBoss Fuse Tooling :: JMX :: Plugins ............... SUCCESS [ 0.004 s]
[INFO] JBoss Fuse Tooling :: JMX :: Plugins :: JMX Commons SUCCESS [ 0.316 s]
[INFO] JBoss Fuse Tooling :: Camel Editor :: Plugins :: Launcher SUCCESS [ 0.442 s]
[INFO] JBoss Fuse Tooling :: Camel Editor :: Plugins :: Camel Editor SUCCESS [ 0.873 s]
[INFO] JBoss Fuse Tooling :: Core :: Tests :: Camel Service Core Integration Tests SUCCESS
[ 13.202 s]
[INFO] JBoss Fuse Tooling :: Core :: Tests :: Camel Model Tests SUCCESS [ 7.959 s]
[INFO] JBoss Fuse Tooling :: Core :: Tests :: Camel Validation Integration Tests SUCCESS [
0.317 s]
[INFO] JBoss Fuse Tooling :: Core :: Tests :: Camel Validation Tests SUCCESS [ 1.583 s]
[INFO] JBoss Fuse Tooling :: Core :: Tests :: Camel Validation Integration Tests SUCCESS [
8.368 s]
[INFO] JBoss Fuse Tooling :: Core :: Features ............. SUCCESS [ 0.007 s]
[INFO] JBoss Fuse Tooling :: Core :: Features :: Core Feature SUCCESS [ 0.231 s]
[INFO] JBoss Fuse Tooling :: Camel Editor :: Plugins :: XSD Catalogs SUCCESS [ 0.047 s]
[INFO] JBoss Fuse Tooling :: Camel Editor :: Plugins :: Launcher UI SUCCESS [ 0.304 s]
[INFO] JBoss Fuse Tooling :: Camel Editor :: Plugins :: Project SUCCESS [ 0.443 s]
[INFO] JBoss Fuse Tooling :: Camel Editor :: Plugins :: Project Templates SUCCESS [ 1.224
s]
[INFO] JBoss Fuse Tooling :: Camel Editor :: Tests ........ SUCCESS [ 0.008 s]
[INFO] JBoss Fuse Tooling :: Camel Editor :: Tests :: Camel Editor Tests SUCCESS [ 3.099
s]
[INFO] JBoss Fuse Tooling :: Camel Editor :: Tests :: Camel Editor Integration Tests
SUCCESS [ 39.302 s]
[INFO] JBoss Fuse Tooling :: Camel Editor :: Tests :: Camel IDE Launcher Tests SUCCESS [
1.670 s]
[INFO] JBoss Fuse Tooling :: Camel Editor :: Tests :: Launcher UI Tests SUCCESS [ 1.773
s]
[INFO] JBoss Fuse Tooling :: Camel Editor :: Tests :: Camel IDE Project Integration Tests
SUCCESS [ 8.001 s]
[INFO] JBoss Fuse Tooling :: Camel Editor :: Tests :: Project Templates Tests SUCCESS [
1.774 s]
[INFO] JBoss Fuse Tooling :: Camel Editor :: Tests :: project Templates Integration Tests
SUCCESS [13:57 min]
[INFO] JBoss Fuse Tooling :: Camel Editor :: Features ..... SUCCESS [ 0.007 s]
[INFO] JBoss Fuse Tooling :: Camel Editor :: Features :: Camel Editor Feature SUCCESS [
0.198 s]
[INFO] JBoss Fuse Tooling :: Data Transformation .......... SUCCESS [ 0.006 s]
[INFO] JBoss Fuse Tooling :: Data Transformation :: Plugins SUCCESS [ 0.004 s]
[INFO] JBoss Fuse Tooling :: Data Transformation :: Plugins :: Core SUCCESS [ 0.500 s]
[INFO] JBoss Fuse Tooling :: Data Transformation :: Plugins :: Editor SUCCESS [ 0.774 s]
[INFO] JBoss Fuse Tooling :: Data Transformation :: Features SUCCESS [ 0.007 s]
[INFO] JBoss Fuse Tooling :: Data Transformation :: Features :: Data Transformation
Feature SUCCESS [ 0.160 s]
[INFO] JBoss Fuse Tooling :: Core Transformation :: Tests . SUCCESS [ 0.005 s]
[INFO] JBoss Fuse Tooling :: Core Transformation :: Tests :: Core Transformation Tests
SUCCESS [ 2.330 s]
[INFO] JBoss Fuse Tooling :: Core Transformation :: Tests :: Core Transformation
Integration Tests SUCCESS [ 9.389 s]
[INFO] JBoss Fuse Tooling :: Editor Transformation :: Tests :: Editor Transformation Tests
SUCCESS [ 1.649 s]
[INFO] JBoss Fuse Tooling :: Transformation Editor :: Tests :: Transformation Editor
Integration Tests SUCCESS [ 10.571 s]
[INFO] JBoss Fuse Tooling :: JMX :: Plugins :: Apache ActiveMQ Facade SUCCESS [ 0.745 s]
[INFO] JBoss Fuse Tooling :: JMX :: Plugins :: Apache Camel Facade SUCCESS [ 0.345 s]
[INFO] JBoss Fuse Tooling :: JMX :: Plugins :: JMX Diagram View SUCCESS [ 0.295 s]
[INFO] JBoss Fuse Tooling :: Server Adapters .............. SUCCESS [ 0.005 s]
[INFO] JBoss Fuse Tooling :: Server Adapters :: Plugins ... SUCCESS [ 0.004 s]
[INFO] JBoss Fuse Tooling :: Server Adapters :: Plugins :: Apache Karaf Adapter Core
SUCCESS [ 0.449 s]
[INFO] JBoss Fuse Tooling :: JMX :: Plugins :: Apache Karaf Facade SUCCESS [ 0.377 s]
[INFO] JBoss Fuse Tooling :: JMX :: Tests ................. SUCCESS [ 0.005 s]
[INFO] JBoss Fuse Tooling :: JMX :: Tests ::Camel ......... SUCCESS [ 1.478 s]
[INFO] JBoss Fuse Tooling :: JMX :: Integration Tests :: Camel SUCCESS [ 7.241 s]
[INFO] JBoss Fuse Tooling :: JMX :: Tests :: Commons ...... SUCCESS [ 1.654 s]
[INFO] JBoss Fuse Tooling :: JMX :: Tests :: Diagram ::View SUCCESS [ 1.729 s]
[INFO] JBoss Fuse Tooling :: JMX :: Features .............. SUCCESS [ 0.004 s]
[INFO] JBoss Fuse Tooling :: Server Adapters :: Plugins :: Commons SUCCESS [ 0.200 s]
[INFO] JBoss Fuse Tooling :: Server Adapters :: Plugins :: Apache Karaf Adapter UI SUCCESS
[ 0.359 s]
[INFO] JBoss Fuse Tooling :: Server Adapters :: Plugins :: JBoss Fuse Adapter Core SUCCESS
[ 0.305 s]
[INFO] JBoss Fuse Tooling :: Server Adapters :: Plugins :: JBoss Fuse Adapter UI SUCCESS [
0.416 s]
[INFO] JBoss Fuse Tooling :: Server Adapters :: Features .. SUCCESS [ 0.006 s]
[INFO] JBoss Fuse Tooling :: Server Adapters :: Features :: Server Adapters Feature
SUCCESS [ 0.152 s]
[INFO] JBoss Fuse Tooling :: JMX :: Features :: JMX Feature SUCCESS [ 0.188 s]
[INFO] JBoss Fuse Tooling :: Server Adapters :: Tests ..... SUCCESS [ 0.005 s]
[INFO] JBoss Fuse Tooling :: Server Adapters :: Tests :: Karaf Core Tests SUCCESS [ 1.695
s]
[INFO] JBoss Fuse Tooling :: Server Adapters :: Tests :: Server Tests FAILURE [40:00 min]
[INFO] JBoss Fuse Tooling :: Update Site .................. SKIPPED
[INFO] ------------------------------------------------------------------------
[INFO] BUILD FAILURE
[INFO] ------------------------------------------------------------------------
[INFO] Total time: 57:14 min
[INFO] Finished at: 2016-11-15T13:13:42-05:00
[INFO] Final Memory: 391M/1564M
[INFO] ------------------------------------------------------------------------
[ERROR] Failed to execute goal org.eclipse.tycho:tycho-surefire-plugin:0.26.0:test
(default-test) on project org.fusesource.ide.server.tests: An unexpected error occured
while launching the test runtime (return code 143). See log for details. -> [Help 1]
[ERROR]
[ERROR] To see the full stack trace of the errors, re-run Maven with the -e switch.
[ERROR] Re-run Maven using the -X switch to enable full debug logging.
[ERROR]
[ERROR] For more information about the errors and possible solutions, please read the
following articles:
[ERROR] [Help 1]
http://cwiki.apache.org/confluence/display/MAVEN/MojoFailureException
[ERROR]
[ERROR] After correcting the problems, you can resume the build with the command
[ERROR] mvn <goals> -rf :org.fusesource.ide.server.tests
Build step 'Invoke top-level Maven targets' marked build as failure
Terminating xvnc.
$ vncserver -kill :45
Killing Xvnc process ID 27022
[locks-and-latches] Releasing all the locks
[locks-and-latches] All the locks released
Recording test results