Build failed in Jenkins: SwitchYard-Release-WildFly #397
by ci-builds@redhat.com
See <http://jenkins.mw.lab.eng.bos.redhat.com/hudson/job/SwitchYard-Release-Wi...>
------------------------------------------
Started by timer
[EnvInject] - Loading node environment variables.
Building remotely on dev09-rhel5-ia64 in workspace <http://jenkins.mw.lab.eng.bos.redhat.com/hudson/job/SwitchYard-Release-Wi...>
Cloning the remote Git repository
Cloning repository git://github.com/jboss-switchyard/release.git
Fetching upstream changes from git://github.com/jboss-switchyard/release.git
Fetching upstream changes from git://github.com/jboss-switchyard/release.git
Checking out Revision 88d6bc28ad8ae494a2ca039417fae1cf60f36617 (origin/master)
[SwitchYard-Release-WildFly] $ bash -xe /tmp/hudson244296791639294489.sh
+ . /home/hudson/config_repository/scripts/common/common_bash.sh
++ basedir=/home/hudson/config_repository
++ common_variables=/home/hudson/config_repository/resources/common.variables
++ for function in '$basedir/scripts/function.d/*'
++ . /home/hudson/config_repository/scripts/function.d/chprop
++ for function in '$basedir/scripts/function.d/*'
++ . /home/hudson/config_repository/scripts/function.d/copy-eap-results
++ for function in '$basedir/scripts/function.d/*'
++ . /home/hudson/config_repository/scripts/function.d/get-soa
++ for function in '$basedir/scripts/function.d/*'
++ . /home/hudson/config_repository/scripts/function.d/get-soa5
++ for function in '$basedir/scripts/function.d/*'
++ . /home/hudson/config_repository/scripts/function.d/kill-children
++ for function in '$basedir/scripts/function.d/*'
++ . /home/hudson/config_repository/scripts/function.d/kill-derby
++ for function in '$basedir/scripts/function.d/*'
++ . /home/hudson/config_repository/scripts/function.d/kill-glassfish
++ for function in '$basedir/scripts/function.d/*'
++ . /home/hudson/config_repository/scripts/function.d/kill-httpd
++ for function in '$basedir/scripts/function.d/*'
++ . /home/hudson/config_repository/scripts/function.d/kill-iis
++ for function in '$basedir/scripts/function.d/*'
++ . /home/hudson/config_repository/scripts/function.d/kill-jboss
++ for function in '$basedir/scripts/function.d/*'
++ . /home/hudson/config_repository/scripts/function.d/kill-jboss7
++ for function in '$basedir/scripts/function.d/*'
++ . /home/hudson/config_repository/scripts/function.d/kill-pointbase
++ for function in '$basedir/scripts/function.d/*'
++ . /home/hudson/config_repository/scripts/function.d/kill-rmiiiop-server
++ for function in '$basedir/scripts/function.d/*'
++ . /home/hudson/config_repository/scripts/function.d/kill-sunri
++ for function in '$basedir/scripts/function.d/*'
++ . /home/hudson/config_repository/scripts/function.d/load_all_vars
+++ . /home/hudson/config_repository/resources/common.variables
++++ JAVA14=/qa/tools/opt/j2sdk1.4.2_15
++++ JAVA15=/qa/tools/opt/jdk1.5.0_last
++++ JAVA16=/qa/tools/opt/jdk1.6.0_last
++++ JAVA17=/qa/tools/opt/jdk1.7.0_last
++++ ANT162=/qa/tools/opt/apache-ant-1.6.2
++++ ANT165=/qa/tools/opt/apache-ant-1.6.5
++++ ANT165_jbpm=/home/hudson/static_build_env/jbpm/apache-ant-1.6.5
++++ ANT165_jbpm_soa=/home/hudson/static_build_env/jbpm.3_soa/apache-ant-1.6.5
++++ ANT170=/qa/tools/opt/apache-ant-1.7.0
++++ ANT171=/qa/tools/opt/apache-ant-1.7.1
++++ ANT181=/qa/tools/opt/apache-ant-1.8.1
++++ ANT183=/qa/tools/opt/apache-ant-1.8.3
++++ MAVEN20x=/qa/tools/opt/maven-2.0.9
++++ MAVEN2010=/qa/tools/opt/maven-2.0.10
++++ MAVEN21x=/qa/tools/opt/maven-2.1.0
++++ MAVEN221=/qa/tools/opt/maven-2.2.1
++++ MAVEN301=/qa/tools/opt/maven-3.0.1
++++ MAVEN303=/qa/tools/opt/maven-3.0.3
++ for function in '$basedir/scripts/function.d/*'
++ . /home/hudson/config_repository/scripts/function.d/runejb3tck
++ for function in '$basedir/scripts/function.d/*'
++ . /home/hudson/config_repository/scripts/function.d/runejb3tck6
++ for function in '$basedir/scripts/function.d/*'
++ . /home/hudson/config_repository/scripts/function.d/runejb3tck-mdbsubset
++ for function in '$basedir/scripts/function.d/*'
++ . /home/hudson/config_repository/scripts/function.d/runjpaentitytck7
++ for function in '$basedir/scripts/function.d/*'
++ . /home/hudson/config_repository/scripts/function.d/runjpamisctck7
++ for function in '$basedir/scripts/function.d/*'
++ . /home/hudson/config_repository/scripts/function.d/runtck
++ for function in '$basedir/scripts/function.d/*'
++ . /home/hudson/config_repository/scripts/function.d/runtck6
++ for function in '$basedir/scripts/function.d/*'
++ . /home/hudson/config_repository/scripts/function.d/runtck7
++ for function in '$basedir/scripts/function.d/*'
++ . /home/hudson/config_repository/scripts/function.d/setant
++ for function in '$basedir/scripts/function.d/*'
++ . /home/hudson/config_repository/scripts/function.d/setjava
++ for function in '$basedir/scripts/function.d/*'
++ . /home/hudson/config_repository/scripts/function.d/setmaven2
++ for function in '$basedir/scripts/function.d/*'
++ . /home/hudson/config_repository/scripts/function.d/setmaven2-win
++ for function in '$basedir/scripts/function.d/*'
++ . /home/hudson/config_repository/scripts/function.d/stacktrace
++ for function in '$basedir/scripts/function.d/*'
++ . /home/hudson/config_repository/scripts/function.d/start-jboss
++ for function in '$basedir/scripts/function.d/*'
++ . /home/hudson/config_repository/scripts/function.d/stop-jboss
++ for function in '$basedir/scripts/function.d/*'
++ . /home/hudson/config_repository/scripts/function.d/versions
+ kill-jboss
++ uname -s
+ [[ Linux == \L\i\n\u\x ]]
+ local 'PS=ps -eaf --columns 20000 | grep run.jar | grep -v -w grep | awk '\''{ print $2; }'\'''
+ eval 'ps -eaf --columns 20000 | grep run.jar | grep -v -w grep | awk '\''{ print $2; }'\'''
++ ps -eaf --columns 20000
++ grep run.jar
+ xargs kill -3
++ grep -v -w grep
++ awk '{ print $2; }'
usage: kill [ -s signal | -p ] [ -a ] pid ...
kill -l [ signal ]
+ sleep 1
+ eval 'ps -eaf --columns 20000 | grep run.jar | grep -v -w grep | awk '\''{ print $2; }'\'''
++ ps -eaf --columns 20000
++ grep run.jar
++ grep -v -w grep
++ awk '{ print $2; }'
+ xargs kill
usage: kill [ -s signal | -p ] [ -a ] pid ...
kill -l [ signal ]
+ sleep 10
+ eval 'ps -eaf --columns 20000 | grep run.jar | grep -v -w grep | awk '\''{ print $2; }'\'''
++ ps -eaf --columns 20000
++ grep run.jar
++ grep -v -w grep
++ awk '{ print $2; }'
+ xargs kill -9
usage: kill [ -s signal | -p ] [ -a ] pid ...
kill -l [ signal ]
+ return 0
+ kill-jboss7
++ uname -s
+ [[ Linux == \L\i\n\u\x ]]
+ local 'PS=ps -eaf --columns 20000 | grep jboss-modules.jar | grep -v -w grep | awk '\''{ print $2; }'\'''
+ eval 'ps -eaf --columns 20000 | grep jboss-modules.jar | grep -v -w grep | awk '\''{ print $2; }'\'''
++ ps -eaf --columns 20000
++ grep jboss-modules.jar
++ grep -v -w grep
++ awk '{ print $2; }'
+ xargs kill -3
usage: kill [ -s signal | -p ] [ -a ] pid ...
kill -l [ signal ]
+ sleep 1
+ eval 'ps -eaf --columns 20000 | grep jboss-modules.jar | grep -v -w grep | awk '\''{ print $2; }'\'''
++ ps -eaf --columns 20000
++ grep jboss-modules.jar
++ grep -v -w grep
++ awk '{ print $2; }'
+ xargs kill
usage: kill [ -s signal | -p ] [ -a ] pid ...
kill -l [ signal ]
+ sleep 10
+ eval 'ps -eaf --columns 20000 | grep jboss-modules.jar | grep -v -w grep | awk '\''{ print $2; }'\'''
++ ps -eaf --columns 20000
++ grep jboss-modules.jar
++ grep -v -w grep
+ xargs kill -9
++ awk '{ print $2; }'
usage: kill [ -s signal | -p ] [ -a ] pid ...
kill -l [ signal ]
+ return 0
[SwitchYard-Release-WildFly] $ /qa/tools/opt/apache-maven-3.0.3/bin/mvn -Dmaven.test.failure.ignore=true -Dmaven.repo.local=<http://jenkins.mw.lab.eng.bos.redhat.com/hudson/job/SwitchYard-Release-Wi...> -U -P-eap,wildfly clean install
Error: JAVA_HOME is not defined correctly.
We cannot execute /qa/tools/opt/ia64/jdk1.7.0_last/bin/java
Build step 'Invoke top-level Maven targets' marked build as failure
Archiving artifacts
Recording test results
8 years, 7 months
Build failed in Jenkins: SwitchYard-Release #1821
by ci-builds@redhat.com
See <http://jenkins.mw.lab.eng.bos.redhat.com/hudson/job/SwitchYard-Release/1821/>
------------------------------------------
[...truncated 3021 lines...]
[INFO] --- maven-clean-plugin:2.5:clean (default-clean) @ switchyard-deploy-jboss-as7 ---
[INFO] Deleting <http://jenkins.mw.lab.eng.bos.redhat.com/hudson/job/SwitchYard-Release/ws...>
[INFO]
[INFO] --- maven-enforcer-plugin:1.3.1:enforce (enforce-java-version) @ switchyard-deploy-jboss-as7 ---
[INFO]
[INFO] --- maven-enforcer-plugin:1.3.1:enforce (enforce-maven-version) @ switchyard-deploy-jboss-as7 ---
[INFO]
[INFO] --- maven-enforcer-plugin:1.3.1:enforce (ban-uberjars) @ switchyard-deploy-jboss-as7 ---
[INFO]
[INFO] --- maven-enforcer-plugin:1.3.1:enforce (no-managed-deps) @ switchyard-deploy-jboss-as7 ---
[INFO]
[INFO] --- buildnumber-maven-plugin:1.2:create-timestamp (get-build-timestamp) @ switchyard-deploy-jboss-as7 ---
[INFO]
[INFO] --- buildnumber-maven-plugin:1.2:create (get-scm-revision) @ switchyard-deploy-jboss-as7 ---
[INFO]
[INFO] --- maven-bundle-plugin:2.4.0:cleanVersions (cleanVersions) @ switchyard-deploy-jboss-as7 ---
[INFO]
[INFO] --- maven-resources-plugin:2.4.3:resources (default-resources) @ switchyard-deploy-jboss-as7 ---
[INFO] Using 'UTF-8' encoding to copy filtered resources.
[INFO] Copying 10 resources
[INFO]
[INFO] --- maven-compiler-plugin:2.3.2:compile (default-compile) @ switchyard-deploy-jboss-as7 ---
[INFO] Compiling 66 source files to <http://jenkins.mw.lab.eng.bos.redhat.com/hudson/job/SwitchYard-Release/ws...>
[WARNING] bootstrap class path not set in conjunction with -source 1.6
<http://jenkins.mw.lab.eng.bos.redhat.com/hudson/job/SwitchYard-Release/ws...>:[6,24] [deprecation] Cause in org.jboss.logging has been deprecated
[WARNING] <http://jenkins.mw.lab.eng.bos.redhat.com/hudson/job/SwitchYard-Release/ws...>:[6,24] [deprecation] Cause in org.jboss.logging has been deprecated
[WARNING] <http://jenkins.mw.lab.eng.bos.redhat.com/hudson/job/SwitchYard-Release/ws...>:[71,85] [deprecation] Cause in org.jboss.logging has been deprecated
[WARNING] <http://jenkins.mw.lab.eng.bos.redhat.com/hudson/job/SwitchYard-Release/ws...>:[96,63] [deprecation] Cause in org.jboss.logging has been deprecated
[WARNING] <http://jenkins.mw.lab.eng.bos.redhat.com/hudson/job/SwitchYard-Release/ws...>:[33,52] [deprecation] Cause in org.jboss.logging has been deprecated
[WARNING] <http://jenkins.mw.lab.eng.bos.redhat.com/hudson/job/SwitchYard-Release/ws...>:[49,53] [deprecation] Cause in org.jboss.logging has been deprecated
[WARNING] <http://jenkins.mw.lab.eng.bos.redhat.com/hudson/job/SwitchYard-Release/ws...>:[58,54] [deprecation] Cause in org.jboss.logging has been deprecated
[WARNING] <http://jenkins.mw.lab.eng.bos.redhat.com/hudson/job/SwitchYard-Release/ws...>:[67,46] [deprecation] Cause in org.jboss.logging has been deprecated
[WARNING] <http://jenkins.mw.lab.eng.bos.redhat.com/hudson/job/SwitchYard-Release/ws...>:[76,46] [deprecation] Cause in org.jboss.logging has been deprecated
[WARNING] <http://jenkins.mw.lab.eng.bos.redhat.com/hudson/job/SwitchYard-Release/ws...>:[85,45] [deprecation] Cause in org.jboss.logging has been deprecated
[WARNING] <http://jenkins.mw.lab.eng.bos.redhat.com/hudson/job/SwitchYard-Release/ws...>:[94,48] [deprecation] Cause in org.jboss.logging has been deprecated
[WARNING] <http://jenkins.mw.lab.eng.bos.redhat.com/hudson/job/SwitchYard-Release/ws...>:[103,39] [deprecation] Cause in org.jboss.logging has been deprecated
[WARNING] <http://jenkins.mw.lab.eng.bos.redhat.com/hudson/job/SwitchYard-Release/ws...>:[6,24] [deprecation] Cause in org.jboss.logging has been deprecated
[WARNING] <http://jenkins.mw.lab.eng.bos.redhat.com/hudson/job/SwitchYard-Release/ws...>:[6,24] [deprecation] Cause in org.jboss.logging has been deprecated
[WARNING] <http://jenkins.mw.lab.eng.bos.redhat.com/hudson/job/SwitchYard-Release/ws...>:[71,85] [deprecation] Cause in org.jboss.logging has been deprecated
[WARNING] <http://jenkins.mw.lab.eng.bos.redhat.com/hudson/job/SwitchYard-Release/ws...>:[96,63] [deprecation] Cause in org.jboss.logging has been deprecated
[WARNING] <http://jenkins.mw.lab.eng.bos.redhat.com/hudson/job/SwitchYard-Release/ws...>:[33,52] [deprecation] Cause in org.jboss.logging has been deprecated
[WARNING] <http://jenkins.mw.lab.eng.bos.redhat.com/hudson/job/SwitchYard-Release/ws...>:[49,53] [deprecation] Cause in org.jboss.logging has been deprecated
[WARNING] <http://jenkins.mw.lab.eng.bos.redhat.com/hudson/job/SwitchYard-Release/ws...>:[58,54] [deprecation] Cause in org.jboss.logging has been deprecated
[WARNING] <http://jenkins.mw.lab.eng.bos.redhat.com/hudson/job/SwitchYard-Release/ws...>:[67,46] [deprecation] Cause in org.jboss.logging has been deprecated
[WARNING] <http://jenkins.mw.lab.eng.bos.redhat.com/hudson/job/SwitchYard-Release/ws...>:[76,46] [deprecation] Cause in org.jboss.logging has been deprecated
[WARNING] <http://jenkins.mw.lab.eng.bos.redhat.com/hudson/job/SwitchYard-Release/ws...>:[85,45] [deprecation] Cause in org.jboss.logging has been deprecated
[WARNING] <http://jenkins.mw.lab.eng.bos.redhat.com/hudson/job/SwitchYard-Release/ws...>:[94,48] [deprecation] Cause in org.jboss.logging has been deprecated
[WARNING] <http://jenkins.mw.lab.eng.bos.redhat.com/hudson/job/SwitchYard-Release/ws...>:[103,39] [deprecation] Cause in org.jboss.logging has been deprecated
[WARNING] <http://jenkins.mw.lab.eng.bos.redhat.com/hudson/job/SwitchYard-Release/ws...>:[6,24] [deprecation] Cause in org.jboss.logging has been deprecated
[WARNING] <http://jenkins.mw.lab.eng.bos.redhat.com/hudson/job/SwitchYard-Release/ws...>:[6,24] [deprecation] Cause in org.jboss.logging has been deprecated
[WARNING] <http://jenkins.mw.lab.eng.bos.redhat.com/hudson/job/SwitchYard-Release/ws...>:[71,85] [deprecation] Cause in org.jboss.logging has been deprecated
[WARNING] <http://jenkins.mw.lab.eng.bos.redhat.com/hudson/job/SwitchYard-Release/ws...>:[96,63] [deprecation] Cause in org.jboss.logging has been deprecated
[WARNING] <http://jenkins.mw.lab.eng.bos.redhat.com/hudson/job/SwitchYard-Release/ws...>:[33,52] [deprecation] Cause in org.jboss.logging has been deprecated
[WARNING] <http://jenkins.mw.lab.eng.bos.redhat.com/hudson/job/SwitchYard-Release/ws...>:[49,53] [deprecation] Cause in org.jboss.logging has been deprecated
[WARNING] <http://jenkins.mw.lab.eng.bos.redhat.com/hudson/job/SwitchYard-Release/ws...>:[58,54] [deprecation] Cause in org.jboss.logging has been deprecated
[WARNING] <http://jenkins.mw.lab.eng.bos.redhat.com/hudson/job/SwitchYard-Release/ws...>:[67,46] [deprecation] Cause in org.jboss.logging has been deprecated
[WARNING] <http://jenkins.mw.lab.eng.bos.redhat.com/hudson/job/SwitchYard-Release/ws...>:[76,46] [deprecation] Cause in org.jboss.logging has been deprecated
[WARNING] <http://jenkins.mw.lab.eng.bos.redhat.com/hudson/job/SwitchYard-Release/ws...>:[85,45] [deprecation] Cause in org.jboss.logging has been deprecated
[WARNING] <http://jenkins.mw.lab.eng.bos.redhat.com/hudson/job/SwitchYard-Release/ws...>:[94,48] [deprecation] Cause in org.jboss.logging has been deprecated
[WARNING] <http://jenkins.mw.lab.eng.bos.redhat.com/hudson/job/SwitchYard-Release/ws...>:[103,39] [deprecation] Cause in org.jboss.logging has been deprecated
[WARNING] <http://jenkins.mw.lab.eng.bos.redhat.com/hudson/job/SwitchYard-Release/ws...>:[6,24] [deprecation] Cause in org.jboss.logging has been deprecated
[WARNING] <http://jenkins.mw.lab.eng.bos.redhat.com/hudson/job/SwitchYard-Release/ws...>:[6,24] [deprecation] Cause in org.jboss.logging has been deprecated
[WARNING] <http://jenkins.mw.lab.eng.bos.redhat.com/hudson/job/SwitchYard-Release/ws...>:[71,85] [deprecation] Cause in org.jboss.logging has been deprecated
[WARNING] <http://jenkins.mw.lab.eng.bos.redhat.com/hudson/job/SwitchYard-Release/ws...>:[96,63] [deprecation] Cause in org.jboss.logging has been deprecated
[WARNING] <http://jenkins.mw.lab.eng.bos.redhat.com/hudson/job/SwitchYard-Release/ws...>:[33,52] [deprecation] Cause in org.jboss.logging has been deprecated
[WARNING] <http://jenkins.mw.lab.eng.bos.redhat.com/hudson/job/SwitchYard-Release/ws...>:[49,53] [deprecation] Cause in org.jboss.logging has been deprecated
[WARNING] <http://jenkins.mw.lab.eng.bos.redhat.com/hudson/job/SwitchYard-Release/ws...>:[58,54] [deprecation] Cause in org.jboss.logging has been deprecated
[WARNING] <http://jenkins.mw.lab.eng.bos.redhat.com/hudson/job/SwitchYard-Release/ws...>:[67,46] [deprecation] Cause in org.jboss.logging has been deprecated
[WARNING] <http://jenkins.mw.lab.eng.bos.redhat.com/hudson/job/SwitchYard-Release/ws...>:[76,46] [deprecation] Cause in org.jboss.logging has been deprecated
[WARNING] <http://jenkins.mw.lab.eng.bos.redhat.com/hudson/job/SwitchYard-Release/ws...>:[85,45] [deprecation] Cause in org.jboss.logging has been deprecated
[WARNING] <http://jenkins.mw.lab.eng.bos.redhat.com/hudson/job/SwitchYard-Release/ws...>:[94,48] [deprecation] Cause in org.jboss.logging has been deprecated
[WARNING] <http://jenkins.mw.lab.eng.bos.redhat.com/hudson/job/SwitchYard-Release/ws...>:[103,39] [deprecation] Cause in org.jboss.logging has been deprecated
[WARNING] <http://jenkins.mw.lab.eng.bos.redhat.com/hudson/job/SwitchYard-Release/ws...>:[182,61] [deprecation] OPTIONAL in DependencyType has been deprecated
[WARNING] <http://jenkins.mw.lab.eng.bos.redhat.com/hudson/job/SwitchYard-Release/ws...>:[46,44] [deprecation] getChild(URL) in VFS has been deprecated
[WARNING] <http://jenkins.mw.lab.eng.bos.redhat.com/hudson/job/SwitchYard-Release/ws...>:[126,45] [deprecation] OPTIONAL in DependencyType has been deprecated
[INFO]
[INFO] --- maven-enforcer-plugin:1.3.1:enforce (enforce-direct-dependencies) @ switchyard-deploy-jboss-as7 ---
[INFO] Flag 'useClassesFromLastBuild' is set. Try to use existing output folder.
[INFO] Analyze dependencies of artifact 'org.switchyard:switchyard-deploy-jboss-as7:jar:2.0.0.Final'.
[INFO] Artifact 'org.switchyard.quickstarts:switchyard-ear-deployment-ear-assembly:ear:2.0.0.Final:test' associated file '<http://jenkins.mw.lab.eng.bos.redhat.com/hudson/job/SwitchYard-Release/ws...',> is skipped.
[INFO] No illegal transitive dependencies found in 'org.switchyard:switchyard-deploy-jboss-as7:jar:2.0.0.Final'.
[INFO]
[INFO] --- maven-resources-plugin:2.4.3:testResources (default-testResources) @ switchyard-deploy-jboss-as7 ---
[INFO] Using 'UTF-8' encoding to copy filtered resources.
[INFO] skip non existing resourceDirectory <http://jenkins.mw.lab.eng.bos.redhat.com/hudson/job/SwitchYard-Release/ws...>
[INFO]
[INFO] --- maven-compiler-plugin:2.3.2:testCompile (default-testCompile) @ switchyard-deploy-jboss-as7 ---
[INFO] No sources to compile
[INFO]
[INFO] --- maven-surefire-plugin:2.6:test (default-test) @ switchyard-deploy-jboss-as7 ---
[INFO] No tests to run.
[INFO] Surefire report directory: <http://jenkins.mw.lab.eng.bos.redhat.com/hudson/job/SwitchYard-Release/ws...>
-------------------------------------------------------
T E S T S
-------------------------------------------------------
There are no tests to run.
Results :
Tests run: 0, Failures: 0, Errors: 0, Skipped: 0
[INFO]
[INFO] --- maven-jar-plugin:2.3.1:jar (default-jar) @ switchyard-deploy-jboss-as7 ---
[INFO] Building jar: <http://jenkins.mw.lab.eng.bos.redhat.com/hudson/job/SwitchYard-Release/ws...>
[INFO]
[INFO] --- maven-source-plugin:2.1.1:jar-no-fork (attach-sources) @ switchyard-deploy-jboss-as7 ---
[INFO] Building jar: <http://jenkins.mw.lab.eng.bos.redhat.com/hudson/job/SwitchYard-Release/ws...>
[INFO]
[INFO] --- maven-install-plugin:2.4:install (default-install) @ switchyard-deploy-jboss-as7 ---
[INFO] Installing <http://jenkins.mw.lab.eng.bos.redhat.com/hudson/job/SwitchYard-Release/ws...> to <http://jenkins.mw.lab.eng.bos.redhat.com/hudson/job/SwitchYard-Release/ws...>
[INFO] Installing <http://jenkins.mw.lab.eng.bos.redhat.com/hudson/job/SwitchYard-Release/ws...> to <http://jenkins.mw.lab.eng.bos.redhat.com/hudson/job/SwitchYard-Release/ws...>
[INFO] Installing <http://jenkins.mw.lab.eng.bos.redhat.com/hudson/job/SwitchYard-Release/ws...> to <http://jenkins.mw.lab.eng.bos.redhat.com/hudson/job/SwitchYard-Release/ws...>
[INFO]
[INFO] ------------------------------------------------------------------------
[INFO] Building SwitchYard: AS7 Modules 2.0.0.Final
[INFO] ------------------------------------------------------------------------
Downloading: https://repository.jboss.org/nexus/content/repositories/deprecated/tranql...
Downloading: https://repository.jboss.org/nexus/content/groups/developer/tranql/tranql...
Downloading: http://snapshots.jboss.org/maven2/tranql/tranql-connector/1.2/tranql-conn...
Downloading: http://repository.jboss.org/maven2/tranql/tranql-connector/1.2/tranql-con...
Downloading: https://repository.jboss.org/nexus/content/groups/public/tranql/tranql-co...
Downloading: https://repository.jboss.org/nexus/content/repositories/deprecated/tranql...
Downloading: http://maven.repository.redhat.com/techpreview/all/tranql/tranql-connecto...
Downloading: https://repository.jboss.org/nexus/content/repositories/fs-releases/tranq...
Downloading: http://repo1.maven.org/maven2/tranql/tranql-connector/1.2/tranql-connecto...
Downloading: http://maven.repository.redhat.com/techpreview/all/tranql/tranql-connecto...
[WARNING] The POM for tranql:tranql-connector:jar:1.2 is missing, no dependency information available
Downloading: https://repository.jboss.org/nexus/content/repositories/deprecated/org/fu...
Downloading: https://repository.jboss.org/nexus/content/groups/developer/org/fusesourc...
Downloading: http://snapshots.jboss.org/maven2/org/fusesource/camel-sap/6.2.0.redhat-0...
Downloading: http://repository.jboss.org/maven2/org/fusesource/camel-sap/6.2.0.redhat-...
Downloading: https://repository.jboss.org/nexus/content/groups/public/org/fusesource/c...
Downloading: https://repository.jboss.org/nexus/content/repositories/deprecated/org/fu...
Downloading: http://maven.repository.redhat.com/techpreview/all/org/fusesource/camel-s...
Downloading: https://repository.jboss.org/nexus/content/repositories/fs-releases/org/f...
Downloading: http://repo1.maven.org/maven2/org/fusesource/camel-sap/6.2.0.redhat-064/c...
[WARNING] The POM for org.fusesource:camel-sap:jar:6.2.0.redhat-064 is missing, no dependency information available
Downloading: https://repository.jboss.org/nexus/content/repositories/deprecated/org/fu...
Downloading: https://repository.jboss.org/nexus/content/groups/developer/org/fusesourc...
Downloading: http://snapshots.jboss.org/maven2/org/fusesource/camel-sap/6.2.0.redhat-0...
Downloading: http://repository.jboss.org/maven2/org/fusesource/camel-sap/6.2.0.redhat-...
Downloading: https://repository.jboss.org/nexus/content/groups/public/org/fusesource/c...
Downloading: https://repository.jboss.org/nexus/content/repositories/deprecated/org/fu...
Downloading: http://maven.repository.redhat.com/techpreview/all/org/fusesource/camel-s...
Downloading: https://repository.jboss.org/nexus/content/repositories/fs-releases/org/f...
Downloading: http://repo1.maven.org/maven2/org/fusesource/camel-sap/6.2.0.redhat-064/c...
[INFO] ------------------------------------------------------------------------
[INFO] Reactor Summary:
[INFO]
[INFO] SwitchYard: Distribution .......................... SUCCESS [5.018s]
[INFO] SwitchYard: Release Distribution Tests Utilities .. SUCCESS [8.568s]
[INFO] SwitchYard: Distribution Artifacts ................ SUCCESS [0.375s]
[INFO] SwitchYard: Tools Distribution .................... SUCCESS [5.696s]
[INFO] SwitchYard: RHQ Plugin ............................ SUCCESS [4.419s]
[INFO] SwitchYard: Container Parent ...................... SUCCESS [2.095s]
[INFO] SwitchYard: AS7 Extension ......................... SUCCESS [15.994s]
[INFO] SwitchYard: AS7 Modules ........................... FAILURE [16.415s]
[INFO] SwitchYard: AS7 Bundle ............................ SKIPPED
[INFO] SwitchYard: Installer ............................. SKIPPED
[INFO] SwitchYard: AS7 Release Distribution Tests ........ SKIPPED
[INFO] SwitchYard: AS7 Standalone Parent ................. SKIPPED
[INFO] SwitchYard: AS7 Distribution ...................... SKIPPED
[INFO] SwitchYard: Karaf ................................. SKIPPED
[INFO] SwitchYard: Karaf Deployer ........................ SKIPPED
[INFO] SwitchYard: Karaf Commands ........................ SKIPPED
[INFO] SwitchYard: BPEL Component Bundle for Karaf ....... SKIPPED
[INFO] SwitchYard: Karaf Features ........................ SKIPPED
[INFO] SwitchYard: Karaf Tests ........................... SKIPPED
[INFO] ------------------------------------------------------------------------
[INFO] BUILD FAILURE
[INFO] ------------------------------------------------------------------------
[INFO] Total time: 1:03.227s
[INFO] Finished at: Sat Nov 14 13:55:41 EST 2015
[INFO] Final Memory: 156M/495M
[INFO] ------------------------------------------------------------------------
[ERROR] Failed to execute goal on project switchyard-as7-modules: Could not resolve dependencies for project org.switchyard:switchyard-as7-modules:jar:2.0.0.Final: Could not find artifact org.fusesource:camel-sap:jar:6.2.0.redhat-064 in jboss-deprecated (https://repository.jboss.org/nexus/content/repositories/deprecated/) -> [Help 1]
[ERROR]
[ERROR] To see the full stack trace of the errors, re-run Maven with the -e switch.
[ERROR] Re-run Maven using the -X switch to enable full debug logging.
[ERROR]
[ERROR] For more information about the errors and possible solutions, please read the following articles:
[ERROR] [Help 1] http://cwiki.apache.org/confluence/display/MAVEN/DependencyResolutionExce...
[ERROR]
[ERROR] After correcting the problems, you can resume the build with the command
[ERROR] mvn <goals> -rf :switchyard-as7-modules
Build step 'Invoke top-level Maven targets' marked build as failure
Archiving artifacts
Recording test results
ERROR: Publisher hudson.tasks.junit.JUnitResultArchiver aborted due to exception
hudson.AbortException: No test report files were found. Configuration error?
at hudson.tasks.junit.JUnitParser$ParseResultCallable.invoke(JUnitParser.java:116)
at hudson.tasks.junit.JUnitParser$ParseResultCallable.invoke(JUnitParser.java:93)
at hudson.FilePath$FileCallableWrapper.call(FilePath.java:2589)
at hudson.remoting.UserRequest.perform(UserRequest.java:121)
at hudson.remoting.UserRequest.perform(UserRequest.java:49)
at hudson.remoting.Request$2.run(Request.java:324)
at hudson.remoting.InterceptingExecutorService$1.call(InterceptingExecutorService.java:68)
at java.util.concurrent.FutureTask.run(FutureTask.java:262)
at java.util.concurrent.ThreadPoolExecutor.runWorker(ThreadPoolExecutor.java:1145)
at java.util.concurrent.ThreadPoolExecutor$Worker.run(ThreadPoolExecutor.java:615)
at java.lang.Thread.run(Thread.java:745)
at ......remote call to dev117-rhel5-x86_64(Native Method)
at hudson.remoting.Channel.attachCallSiteStackTrace(Channel.java:1356)
at hudson.remoting.UserResponse.retrieve(UserRequest.java:221)
at hudson.remoting.Channel.call(Channel.java:752)
at hudson.FilePath.act(FilePath.java:969)
at hudson.FilePath.act(FilePath.java:958)
at hudson.tasks.junit.JUnitParser.parseResult(JUnitParser.java:90)
at hudson.tasks.junit.JUnitResultArchiver.parse(JUnitResultArchiver.java:120)
at hudson.tasks.junit.JUnitResultArchiver.perform(JUnitResultArchiver.java:137)
at hudson.tasks.BuildStepCompatibilityLayer.perform(BuildStepCompatibilityLayer.java:74)
at hudson.tasks.BuildStepMonitor$1.perform(BuildStepMonitor.java:20)
at hudson.model.AbstractBuild$AbstractBuildExecution.perform(AbstractBuild.java:770)
at hudson.model.AbstractBuild$AbstractBuildExecution.performAllBuildSteps(AbstractBuild.java:734)
at hudson.model.Build$BuildExecution.post2(Build.java:183)
at hudson.model.AbstractBuild$AbstractBuildExecution.post(AbstractBuild.java:683)
at hudson.model.Run.execute(Run.java:1770)
at hudson.model.FreeStyleBuild.run(FreeStyleBuild.java:43)
at hudson.model.ResourceController.execute(ResourceController.java:89)
at hudson.model.Executor.run(Executor.java:240)
8 years, 7 months
Build failed in Jenkins: SwitchYard-Tools-2.0.x #32
by ci-builds@redhat.com
See <http://jenkins.mw.lab.eng.bos.redhat.com/hudson/job/SwitchYard-Tools-2.0....>
------------------------------------------
[...truncated 106 lines...]
at hudson.remoting.Channel.call(Channel.java:752)
... 15 more
Retrying after 10 seconds
java.io.IOException: remote file operation failed: <http://jenkins.mw.lab.eng.bos.redhat.com/hudson/job/SwitchYard-Tools-2.0....> at hudson.remoting.Channel@22ca4fe4:dev133-virt2: java.io.IOException: Remote call on dev133-virt2 failed
at hudson.FilePath.act(FilePath.java:976)
at hudson.FilePath.act(FilePath.java:958)
at org.jenkinsci.plugins.gitclient.Git.getClient(Git.java:131)
at hudson.plugins.git.GitSCM.createClient(GitSCM.java:677)
at hudson.plugins.git.GitSCM.createClient(GitSCM.java:669)
at hudson.plugins.git.GitSCM.checkout(GitSCM.java:1010)
at hudson.scm.SCM.checkout(SCM.java:484)
at hudson.model.AbstractProject.checkout(AbstractProject.java:1257)
at hudson.model.AbstractBuild$AbstractBuildExecution.defaultCheckout(AbstractBuild.java:622)
at jenkins.scm.SCMCheckoutStrategy.checkout(SCMCheckoutStrategy.java:86)
at hudson.model.AbstractBuild$AbstractBuildExecution.run(AbstractBuild.java:528)
at hudson.model.Run.execute(Run.java:1745)
at hudson.model.FreeStyleBuild.run(FreeStyleBuild.java:43)
at hudson.model.ResourceController.execute(ResourceController.java:89)
at hudson.model.Executor.run(Executor.java:240)
Caused by: java.io.IOException: Remote call on dev133-virt2 failed
at hudson.remoting.Channel.call(Channel.java:760)
at hudson.FilePath.act(FilePath.java:969)
... 14 more
Caused by: java.lang.NoClassDefFoundError: Could not initialize class com.sun.proxy.$Proxy12
at sun.reflect.GeneratedConstructorAccessor5.newInstance(Unknown Source)
at sun.reflect.DelegatingConstructorAccessorImpl.newInstance(DelegatingConstructorAccessorImpl.java:45)
at java.lang.reflect.Constructor.newInstance(Constructor.java:526)
at java.lang.reflect.Proxy.newInstance(Proxy.java:764)
at java.lang.reflect.Proxy.newProxyInstance(Proxy.java:755)
at hudson.remoting.RemoteInvocationHandler.wrap(RemoteInvocationHandler.java:105)
at hudson.remoting.Channel.export(Channel.java:592)
at hudson.remoting.Channel.export(Channel.java:561)
at org.jenkinsci.plugins.gitclient.LegacyCompatibleGitAPIImpl.writeReplace(LegacyCompatibleGitAPIImpl.java:201)
at sun.reflect.GeneratedMethodAccessor18.invoke(Unknown Source)
at sun.reflect.DelegatingMethodAccessorImpl.invoke(DelegatingMethodAccessorImpl.java:43)
at java.lang.reflect.Method.invoke(Method.java:606)
at java.io.ObjectStreamClass.invokeWriteReplace(ObjectStreamClass.java:1075)
at java.io.ObjectOutputStream.writeObject0(ObjectOutputStream.java:1134)
at java.io.ObjectOutputStream.writeObject(ObjectOutputStream.java:347)
at hudson.remoting.UserRequest._serialize(UserRequest.java:158)
at hudson.remoting.UserRequest.serialize(UserRequest.java:167)
at hudson.remoting.UserRequest.perform(UserRequest.java:129)
at hudson.remoting.UserRequest.perform(UserRequest.java:49)
at hudson.remoting.Request$2.run(Request.java:324)
at hudson.remoting.InterceptingExecutorService$1.call(InterceptingExecutorService.java:68)
at java.util.concurrent.FutureTask.run(FutureTask.java:262)
at java.util.concurrent.ThreadPoolExecutor.runWorker(ThreadPoolExecutor.java:1145)
at java.util.concurrent.ThreadPoolExecutor$Worker.run(ThreadPoolExecutor.java:615)
at hudson.remoting.Engine$1$1.run(Engine.java:63)
at java.lang.Thread.run(Thread.java:745)
at ......remote call to dev133-virt2(Native Method)
at hudson.remoting.Channel.attachCallSiteStackTrace(Channel.java:1356)
at hudson.remoting.UserResponse.retrieve(UserRequest.java:221)
at hudson.remoting.Channel.call(Channel.java:752)
... 15 more
Retrying after 10 seconds
java.io.IOException: remote file operation failed: <http://jenkins.mw.lab.eng.bos.redhat.com/hudson/job/SwitchYard-Tools-2.0....> at hudson.remoting.Channel@22ca4fe4:dev133-virt2: java.io.IOException: Remote call on dev133-virt2 failed
at hudson.FilePath.act(FilePath.java:976)
at hudson.FilePath.act(FilePath.java:958)
at org.jenkinsci.plugins.gitclient.Git.getClient(Git.java:131)
at hudson.plugins.git.GitSCM.createClient(GitSCM.java:677)
at hudson.plugins.git.GitSCM.createClient(GitSCM.java:669)
at hudson.plugins.git.GitSCM.checkout(GitSCM.java:1010)
at hudson.scm.SCM.checkout(SCM.java:484)
at hudson.model.AbstractProject.checkout(AbstractProject.java:1257)
at hudson.model.AbstractBuild$AbstractBuildExecution.defaultCheckout(AbstractBuild.java:622)
at jenkins.scm.SCMCheckoutStrategy.checkout(SCMCheckoutStrategy.java:86)
at hudson.model.AbstractBuild$AbstractBuildExecution.run(AbstractBuild.java:528)
at hudson.model.Run.execute(Run.java:1745)
at hudson.model.FreeStyleBuild.run(FreeStyleBuild.java:43)
at hudson.model.ResourceController.execute(ResourceController.java:89)
at hudson.model.Executor.run(Executor.java:240)
Caused by: java.io.IOException: Remote call on dev133-virt2 failed
at hudson.remoting.Channel.call(Channel.java:760)
at hudson.FilePath.act(FilePath.java:969)
... 14 more
Caused by: java.lang.NoClassDefFoundError: Could not initialize class com.sun.proxy.$Proxy12
at sun.reflect.GeneratedConstructorAccessor5.newInstance(Unknown Source)
at sun.reflect.DelegatingConstructorAccessorImpl.newInstance(DelegatingConstructorAccessorImpl.java:45)
at java.lang.reflect.Constructor.newInstance(Constructor.java:526)
at java.lang.reflect.Proxy.newInstance(Proxy.java:764)
at java.lang.reflect.Proxy.newProxyInstance(Proxy.java:755)
at hudson.remoting.RemoteInvocationHandler.wrap(RemoteInvocationHandler.java:105)
at hudson.remoting.Channel.export(Channel.java:592)
at hudson.remoting.Channel.export(Channel.java:561)
at org.jenkinsci.plugins.gitclient.LegacyCompatibleGitAPIImpl.writeReplace(LegacyCompatibleGitAPIImpl.java:201)
at sun.reflect.GeneratedMethodAccessor18.invoke(Unknown Source)
at sun.reflect.DelegatingMethodAccessorImpl.invoke(DelegatingMethodAccessorImpl.java:43)
at java.lang.reflect.Method.invoke(Method.java:606)
at java.io.ObjectStreamClass.invokeWriteReplace(ObjectStreamClass.java:1075)
at java.io.ObjectOutputStream.writeObject0(ObjectOutputStream.java:1134)
at java.io.ObjectOutputStream.writeObject(ObjectOutputStream.java:347)
at hudson.remoting.UserRequest._serialize(UserRequest.java:158)
at hudson.remoting.UserRequest.serialize(UserRequest.java:167)
at hudson.remoting.UserRequest.perform(UserRequest.java:129)
at hudson.remoting.UserRequest.perform(UserRequest.java:49)
at hudson.remoting.Request$2.run(Request.java:324)
at hudson.remoting.InterceptingExecutorService$1.call(InterceptingExecutorService.java:68)
at java.util.concurrent.FutureTask.run(FutureTask.java:262)
at java.util.concurrent.ThreadPoolExecutor.runWorker(ThreadPoolExecutor.java:1145)
at java.util.concurrent.ThreadPoolExecutor$Worker.run(ThreadPoolExecutor.java:615)
at hudson.remoting.Engine$1$1.run(Engine.java:63)
at java.lang.Thread.run(Thread.java:745)
at ......remote call to dev133-virt2(Native Method)
at hudson.remoting.Channel.attachCallSiteStackTrace(Channel.java:1356)
at hudson.remoting.UserResponse.retrieve(UserRequest.java:221)
at hudson.remoting.Channel.call(Channel.java:752)
... 15 more
Retrying after 10 seconds
java.io.IOException: remote file operation failed: <http://jenkins.mw.lab.eng.bos.redhat.com/hudson/job/SwitchYard-Tools-2.0....> at hudson.remoting.Channel@22ca4fe4:dev133-virt2: java.io.IOException: Remote call on dev133-virt2 failed
at hudson.FilePath.act(FilePath.java:976)
at hudson.FilePath.act(FilePath.java:958)
at org.jenkinsci.plugins.gitclient.Git.getClient(Git.java:131)
at hudson.plugins.git.GitSCM.createClient(GitSCM.java:677)
at hudson.plugins.git.GitSCM.createClient(GitSCM.java:669)
at hudson.plugins.git.GitSCM.checkout(GitSCM.java:1010)
at hudson.scm.SCM.checkout(SCM.java:484)
at hudson.model.AbstractProject.checkout(AbstractProject.java:1257)
at hudson.model.AbstractBuild$AbstractBuildExecution.defaultCheckout(AbstractBuild.java:622)
at jenkins.scm.SCMCheckoutStrategy.checkout(SCMCheckoutStrategy.java:86)
at hudson.model.AbstractBuild$AbstractBuildExecution.run(AbstractBuild.java:528)
at hudson.model.Run.execute(Run.java:1745)
at hudson.model.FreeStyleBuild.run(FreeStyleBuild.java:43)
at hudson.model.ResourceController.execute(ResourceController.java:89)
at hudson.model.Executor.run(Executor.java:240)
Caused by: java.io.IOException: Remote call on dev133-virt2 failed
at hudson.remoting.Channel.call(Channel.java:760)
at hudson.FilePath.act(FilePath.java:969)
... 14 more
Caused by: java.lang.NoClassDefFoundError: Could not initialize class com.sun.proxy.$Proxy12
at sun.reflect.GeneratedConstructorAccessor5.newInstance(Unknown Source)
at sun.reflect.DelegatingConstructorAccessorImpl.newInstance(DelegatingConstructorAccessorImpl.java:45)
at java.lang.reflect.Constructor.newInstance(Constructor.java:526)
at java.lang.reflect.Proxy.newInstance(Proxy.java:764)
at java.lang.reflect.Proxy.newProxyInstance(Proxy.java:755)
at hudson.remoting.RemoteInvocationHandler.wrap(RemoteInvocationHandler.java:105)
at hudson.remoting.Channel.export(Channel.java:592)
at hudson.remoting.Channel.export(Channel.java:561)
at org.jenkinsci.plugins.gitclient.LegacyCompatibleGitAPIImpl.writeReplace(LegacyCompatibleGitAPIImpl.java:201)
at sun.reflect.GeneratedMethodAccessor18.invoke(Unknown Source)
at sun.reflect.DelegatingMethodAccessorImpl.invoke(DelegatingMethodAccessorImpl.java:43)
at java.lang.reflect.Method.invoke(Method.java:606)
at java.io.ObjectStreamClass.invokeWriteReplace(ObjectStreamClass.java:1075)
at java.io.ObjectOutputStream.writeObject0(ObjectOutputStream.java:1134)
at java.io.ObjectOutputStream.writeObject(ObjectOutputStream.java:347)
at hudson.remoting.UserRequest._serialize(UserRequest.java:158)
at hudson.remoting.UserRequest.serialize(UserRequest.java:167)
at hudson.remoting.UserRequest.perform(UserRequest.java:129)
at hudson.remoting.UserRequest.perform(UserRequest.java:49)
at hudson.remoting.Request$2.run(Request.java:324)
at hudson.remoting.InterceptingExecutorService$1.call(InterceptingExecutorService.java:68)
at java.util.concurrent.FutureTask.run(FutureTask.java:262)
at java.util.concurrent.ThreadPoolExecutor.runWorker(ThreadPoolExecutor.java:1145)
at java.util.concurrent.ThreadPoolExecutor$Worker.run(ThreadPoolExecutor.java:615)
at hudson.remoting.Engine$1$1.run(Engine.java:63)
at java.lang.Thread.run(Thread.java:745)
at ......remote call to dev133-virt2(Native Method)
at hudson.remoting.Channel.attachCallSiteStackTrace(Channel.java:1356)
at hudson.remoting.UserResponse.retrieve(UserRequest.java:221)
at hudson.remoting.Channel.call(Channel.java:752)
... 15 more
Retrying after 10 seconds
java.io.IOException: remote file operation failed: <http://jenkins.mw.lab.eng.bos.redhat.com/hudson/job/SwitchYard-Tools-2.0....> at hudson.remoting.Channel@22ca4fe4:dev133-virt2: java.io.IOException: Remote call on dev133-virt2 failed
at hudson.FilePath.act(FilePath.java:976)
at hudson.FilePath.act(FilePath.java:958)
at org.jenkinsci.plugins.gitclient.Git.getClient(Git.java:131)
at hudson.plugins.git.GitSCM.createClient(GitSCM.java:677)
at hudson.plugins.git.GitSCM.createClient(GitSCM.java:669)
at hudson.plugins.git.GitSCM.checkout(GitSCM.java:1010)
at hudson.scm.SCM.checkout(SCM.java:484)
at hudson.model.AbstractProject.checkout(AbstractProject.java:1257)
at hudson.model.AbstractBuild$AbstractBuildExecution.defaultCheckout(AbstractBuild.java:622)
at jenkins.scm.SCMCheckoutStrategy.checkout(SCMCheckoutStrategy.java:86)
at hudson.model.AbstractBuild$AbstractBuildExecution.run(AbstractBuild.java:528)
at hudson.model.Run.execute(Run.java:1745)
at hudson.model.FreeStyleBuild.run(FreeStyleBuild.java:43)
at hudson.model.ResourceController.execute(ResourceController.java:89)
at hudson.model.Executor.run(Executor.java:240)
Caused by: java.io.IOException: Remote call on dev133-virt2 failed
at hudson.remoting.Channel.call(Channel.java:760)
at hudson.FilePath.act(FilePath.java:969)
... 14 more
Caused by: java.lang.NoClassDefFoundError: Could not initialize class com.sun.proxy.$Proxy12
at sun.reflect.GeneratedConstructorAccessor5.newInstance(Unknown Source)
at sun.reflect.DelegatingConstructorAccessorImpl.newInstance(DelegatingConstructorAccessorImpl.java:45)
at java.lang.reflect.Constructor.newInstance(Constructor.java:526)
at java.lang.reflect.Proxy.newInstance(Proxy.java:764)
at java.lang.reflect.Proxy.newProxyInstance(Proxy.java:755)
at hudson.remoting.RemoteInvocationHandler.wrap(RemoteInvocationHandler.java:105)
at hudson.remoting.Channel.export(Channel.java:592)
at hudson.remoting.Channel.export(Channel.java:561)
at org.jenkinsci.plugins.gitclient.LegacyCompatibleGitAPIImpl.writeReplace(LegacyCompatibleGitAPIImpl.java:201)
at sun.reflect.GeneratedMethodAccessor18.invoke(Unknown Source)
at sun.reflect.DelegatingMethodAccessorImpl.invoke(DelegatingMethodAccessorImpl.java:43)
at java.lang.reflect.Method.invoke(Method.java:606)
at java.io.ObjectStreamClass.invokeWriteReplace(ObjectStreamClass.java:1075)
at java.io.ObjectOutputStream.writeObject0(ObjectOutputStream.java:1134)
at java.io.ObjectOutputStream.writeObject(ObjectOutputStream.java:347)
at hudson.remoting.UserRequest._serialize(UserRequest.java:158)
at hudson.remoting.UserRequest.serialize(UserRequest.java:167)
at hudson.remoting.UserRequest.perform(UserRequest.java:129)
at hudson.remoting.UserRequest.perform(UserRequest.java:49)
at hudson.remoting.Request$2.run(Request.java:324)
at hudson.remoting.InterceptingExecutorService$1.call(InterceptingExecutorService.java:68)
at java.util.concurrent.FutureTask.run(FutureTask.java:262)
at java.util.concurrent.ThreadPoolExecutor.runWorker(ThreadPoolExecutor.java:1145)
at java.util.concurrent.ThreadPoolExecutor$Worker.run(ThreadPoolExecutor.java:615)
at hudson.remoting.Engine$1$1.run(Engine.java:63)
at java.lang.Thread.run(Thread.java:745)
at ......remote call to dev133-virt2(Native Method)
at hudson.remoting.Channel.attachCallSiteStackTrace(Channel.java:1356)
at hudson.remoting.UserResponse.retrieve(UserRequest.java:221)
at hudson.remoting.Channel.call(Channel.java:752)
... 15 more
Archiving artifacts
Recording test results
ERROR: Publisher hudson.tasks.junit.JUnitResultArchiver aborted due to exception
hudson.AbortException: No test report files were found. Configuration error?
at hudson.tasks.junit.JUnitParser$ParseResultCallable.invoke(JUnitParser.java:116)
at hudson.tasks.junit.JUnitParser$ParseResultCallable.invoke(JUnitParser.java:93)
at hudson.FilePath$FileCallableWrapper.call(FilePath.java:2589)
at hudson.remoting.UserRequest.perform(UserRequest.java:121)
at hudson.remoting.UserRequest.perform(UserRequest.java:49)
at hudson.remoting.Request$2.run(Request.java:324)
at hudson.remoting.InterceptingExecutorService$1.call(InterceptingExecutorService.java:68)
at java.util.concurrent.FutureTask.run(FutureTask.java:262)
at java.util.concurrent.ThreadPoolExecutor.runWorker(ThreadPoolExecutor.java:1145)
at java.util.concurrent.ThreadPoolExecutor$Worker.run(ThreadPoolExecutor.java:615)
at hudson.remoting.Engine$1$1.run(Engine.java:63)
at java.lang.Thread.run(Thread.java:745)
at ......remote call to dev133-virt2(Native Method)
at hudson.remoting.Channel.attachCallSiteStackTrace(Channel.java:1356)
at hudson.remoting.UserResponse.retrieve(UserRequest.java:221)
at hudson.remoting.Channel.call(Channel.java:752)
at hudson.FilePath.act(FilePath.java:969)
at hudson.FilePath.act(FilePath.java:958)
at hudson.tasks.junit.JUnitParser.parseResult(JUnitParser.java:90)
at hudson.tasks.junit.JUnitResultArchiver.parse(JUnitResultArchiver.java:120)
at hudson.tasks.junit.JUnitResultArchiver.perform(JUnitResultArchiver.java:137)
at hudson.tasks.BuildStepCompatibilityLayer.perform(BuildStepCompatibilityLayer.java:74)
at hudson.tasks.BuildStepMonitor$1.perform(BuildStepMonitor.java:20)
at hudson.model.AbstractBuild$AbstractBuildExecution.perform(AbstractBuild.java:770)
at hudson.model.AbstractBuild$AbstractBuildExecution.performAllBuildSteps(AbstractBuild.java:734)
at hudson.model.Build$BuildExecution.post2(Build.java:183)
at hudson.model.AbstractBuild$AbstractBuildExecution.post(AbstractBuild.java:683)
at hudson.model.Run.execute(Run.java:1770)
at hudson.model.FreeStyleBuild.run(FreeStyleBuild.java:43)
at hudson.model.ResourceController.execute(ResourceController.java:89)
at hudson.model.Executor.run(Executor.java:240)
9 years, 1 month
Build failed in Jenkins: SwitchYard-Tools #610
by ci-builds@redhat.com
See <http://jenkins.mw.lab.eng.bos.redhat.com/hudson/job/SwitchYard-Tools/610/>
------------------------------------------
Started by user bfitzpat(a)REDHAT.COM
[EnvInject] - Loading node environment variables.
Building remotely on dev198 (eap-sustaining ppc64 mwqa_drives_services EAP-RHEL6-PPC64 mem2G beaker mwqa_drives_tools mem4G) in workspace <http://jenkins.mw.lab.eng.bos.redhat.com/hudson/job/SwitchYard-Tools/ws/>
Cloning the remote Git repository
Cloning repository git://github.com/jboss-switchyard/tools.git
> git init <http://jenkins.mw.lab.eng.bos.redhat.com/hudson/job/SwitchYard-Tools/ws/s...> # timeout=10
Fetching upstream changes from git://github.com/jboss-switchyard/tools.git
> git --version # timeout=10
> git -c core.askpass=true fetch --tags --progress git://github.com/jboss-switchyard/tools.git +refs/heads/*:refs/remotes/origin/*
> git config remote.origin.url git://github.com/jboss-switchyard/tools.git # timeout=10
> git config --add remote.origin.fetch +refs/heads/*:refs/remotes/origin/* # timeout=10
> git config remote.origin.url git://github.com/jboss-switchyard/tools.git # timeout=10
Fetching upstream changes from git://github.com/jboss-switchyard/tools.git
> git -c core.askpass=true fetch --tags --progress git://github.com/jboss-switchyard/tools.git +refs/heads/*:refs/remotes/origin/*
> git rev-parse refs/remotes/origin/master^{commit} # timeout=10
> git rev-parse refs/remotes/origin/origin/master^{commit} # timeout=10
Checking out Revision 6e282f1ab23315fa43fbe3629cca0a6e84a50dc3 (refs/remotes/origin/master)
> git config core.sparsecheckout # timeout=10
> git checkout -f 6e282f1ab23315fa43fbe3629cca0a6e84a50dc3
> git rev-list e490dba1786b0864708ea18b7ced2683d29722b3 # timeout=10
warning: unable to access '/qa/services/hudson/.config/git/config': Input/output error
warning: unable to access '/qa/services/hudson/.gitconfig': Input/output error
warning: unable to access '/qa/services/hudson/.config/git/config': Input/output error
warning: unable to access '/qa/services/hudson/.gitconfig': Input/output error
warning: unable to access '/qa/services/hudson/.config/git/config': Input/output error
warning: unable to access '/qa/services/hudson/.gitconfig': Input/output error
warning: unable to access '/qa/services/hudson/.config/git/config': Input/output error
warning: unable to access '/qa/services/hudson/.gitconfig': Input/output error
> git tag -a -f -m Jenkins Build #610 jenkins-SwitchYard-Tools-610 # timeout=10
FATAL: Could not apply tag jenkins-SwitchYard-Tools-610
hudson.plugins.git.GitException: Could not apply tag jenkins-SwitchYard-Tools-610
at org.jenkinsci.plugins.gitclient.CliGitAPIImpl.tag(CliGitAPIImpl.java:1201)
at hudson.plugins.git.GitAPI.tag(GitAPI.java:274)
at sun.reflect.NativeMethodAccessorImpl.invoke0(Native Method)
at sun.reflect.NativeMethodAccessorImpl.invoke(NativeMethodAccessorImpl.java:95)
at sun.reflect.DelegatingMethodAccessorImpl.invoke(DelegatingMethodAccessorImpl.java:56)
at java.lang.reflect.Method.invoke(Method.java:620)
at hudson.remoting.RemoteInvocationHandler$RPCRequest.perform(RemoteInvocationHandler.java:320)
at hudson.remoting.RemoteInvocationHandler$RPCRequest.call(RemoteInvocationHandler.java:295)
at hudson.remoting.RemoteInvocationHandler$RPCRequest.call(RemoteInvocationHandler.java:254)
at hudson.remoting.UserRequest.perform(UserRequest.java:121)
at hudson.remoting.UserRequest.perform(UserRequest.java:49)
at hudson.remoting.Request$2.run(Request.java:324)
at hudson.remoting.InterceptingExecutorService$1.call(InterceptingExecutorService.java:68)
at java.util.concurrent.FutureTask.run(FutureTask.java:274)
at java.util.concurrent.ThreadPoolExecutor.runWorker(ThreadPoolExecutor.java:1157)
at java.util.concurrent.ThreadPoolExecutor$Worker.run(ThreadPoolExecutor.java:627)
at hudson.remoting.Engine$1$1.run(Engine.java:63)
at java.lang.Thread.run(Thread.java:809)
at ......remote call to dev198(Native Method)
at hudson.remoting.Channel.attachCallSiteStackTrace(Channel.java:1356)
at hudson.remoting.UserResponse.retrieve(UserRequest.java:221)
at hudson.remoting.Channel.call(Channel.java:752)
at hudson.remoting.RemoteInvocationHandler.invoke(RemoteInvocationHandler.java:173)
at com.sun.proxy.$Proxy262.tag(Unknown Source)
at org.jenkinsci.plugins.gitclient.RemoteGitImpl.tag(RemoteGitImpl.java:481)
at hudson.plugins.git.extensions.impl.PerBuildTag.onCheckoutCompleted(PerBuildTag.java:30)
at hudson.plugins.git.GitSCM.checkout(GitSCM.java:1047)
at hudson.scm.SCM.checkout(SCM.java:484)
at hudson.model.AbstractProject.checkout(AbstractProject.java:1257)
at hudson.model.AbstractBuild$AbstractBuildExecution.defaultCheckout(AbstractBuild.java:622)
at jenkins.scm.SCMCheckoutStrategy.checkout(SCMCheckoutStrategy.java:86)
at hudson.model.AbstractBuild$AbstractBuildExecution.run(AbstractBuild.java:528)
at hudson.model.Run.execute(Run.java:1745)
at hudson.model.FreeStyleBuild.run(FreeStyleBuild.java:43)
at hudson.model.ResourceController.execute(ResourceController.java:89)
at hudson.model.Executor.run(Executor.java:240)
Caused by: hudson.plugins.git.GitException: Command "git tag -a -f -m Jenkins Build #610 jenkins-SwitchYard-Tools-610" returned status code 128:
stdout:
stderr: warning: unable to access '/qa/services/hudson/.config/git/config': Input/output error
warning: unable to access '/qa/services/hudson/.gitconfig': Input/output error
warning: unable to access '/qa/services/hudson/.config/git/config': Input/output error
warning: unable to access '/qa/services/hudson/.gitconfig': Input/output error
warning: unable to access '/qa/services/hudson/.config/git/config': Input/output error
warning: unable to access '/qa/services/hudson/.gitconfig': Input/output error
*** Please tell me who you are.
Run
git config --global user.email "you(a)example.com"
git config --global user.name "Your Name"
to set your account's default identity.
Omit --global to set the identity only in this repository.
fatal: empty ident name (for <hudson(a)dev198.mw.lab.eng.bos.redhat.com>) not allowed
at org.jenkinsci.plugins.gitclient.CliGitAPIImpl.launchCommandIn(CliGitAPIImpl.java:1591)
at org.jenkinsci.plugins.gitclient.CliGitAPIImpl.launchCommandIn(CliGitAPIImpl.java:1567)
at org.jenkinsci.plugins.gitclient.CliGitAPIImpl.launchCommandIn(CliGitAPIImpl.java:1563)
at org.jenkinsci.plugins.gitclient.CliGitAPIImpl.launchCommand(CliGitAPIImpl.java:1249)
at org.jenkinsci.plugins.gitclient.CliGitAPIImpl.launchCommand(CliGitAPIImpl.java:1261)
at org.jenkinsci.plugins.gitclient.CliGitAPIImpl.tag(CliGitAPIImpl.java:1199)
at hudson.plugins.git.GitAPI.tag(GitAPI.java:274)
at sun.reflect.NativeMethodAccessorImpl.invoke0(Native Method)
at sun.reflect.NativeMethodAccessorImpl.invoke(NativeMethodAccessorImpl.java:95)
at sun.reflect.DelegatingMethodAccessorImpl.invoke(DelegatingMethodAccessorImpl.java:56)
at java.lang.reflect.Method.invoke(Method.java:620)
at hudson.remoting.RemoteInvocationHandler$RPCRequest.perform(RemoteInvocationHandler.java:320)
at hudson.remoting.RemoteInvocationHandler$RPCRequest.call(RemoteInvocationHandler.java:295)
at hudson.remoting.RemoteInvocationHandler$RPCRequest.call(RemoteInvocationHandler.java:254)
at hudson.remoting.UserRequest.perform(UserRequest.java:121)
at hudson.remoting.UserRequest.perform(UserRequest.java:49)
at hudson.remoting.Request$2.run(Request.java:324)
at hudson.remoting.InterceptingExecutorService$1.call(InterceptingExecutorService.java:68)
at java.util.concurrent.FutureTask.run(FutureTask.java:274)
at java.util.concurrent.ThreadPoolExecutor.runWorker(ThreadPoolExecutor.java:1157)
at java.util.concurrent.ThreadPoolExecutor$Worker.run(ThreadPoolExecutor.java:627)
at hudson.remoting.Engine$1$1.run(Engine.java:63)
at java.lang.Thread.run(Thread.java:809)
9 years, 1 month
Build failed in Jenkins: SwitchYard-Tools-2.0.x #24
by ci-builds@redhat.com
See <http://jenkins.mw.lab.eng.bos.redhat.com/hudson/job/SwitchYard-Tools-2.0....>
------------------------------------------
[...truncated 135 lines...]
at hudson.plugins.git.GitSCM.createClient(GitSCM.java:669)
at hudson.plugins.git.GitSCM.checkout(GitSCM.java:1010)
at hudson.scm.SCM.checkout(SCM.java:484)
at hudson.model.AbstractProject.checkout(AbstractProject.java:1257)
at hudson.model.AbstractBuild$AbstractBuildExecution.defaultCheckout(AbstractBuild.java:622)
at jenkins.scm.SCMCheckoutStrategy.checkout(SCMCheckoutStrategy.java:86)
at hudson.model.AbstractBuild$AbstractBuildExecution.run(AbstractBuild.java:528)
at hudson.model.Run.execute(Run.java:1745)
at hudson.model.FreeStyleBuild.run(FreeStyleBuild.java:43)
at hudson.model.ResourceController.execute(ResourceController.java:89)
at hudson.model.Executor.run(Executor.java:240)
Caused by: java.io.IOException: Remote call on dev133-virt2 failed
at hudson.remoting.Channel.call(Channel.java:760)
at hudson.FilePath.act(FilePath.java:969)
... 14 more
Caused by: java.lang.NoClassDefFoundError: Could not initialize class com.sun.proxy.$Proxy12
at sun.reflect.NativeConstructorAccessorImpl.newInstance0(Native Method)
at sun.reflect.NativeConstructorAccessorImpl.newInstance(NativeConstructorAccessorImpl.java:57)
at sun.reflect.DelegatingConstructorAccessorImpl.newInstance(DelegatingConstructorAccessorImpl.java:45)
at java.lang.reflect.Constructor.newInstance(Constructor.java:526)
at java.lang.reflect.Proxy.newInstance(Proxy.java:764)
at java.lang.reflect.Proxy.newProxyInstance(Proxy.java:755)
at hudson.remoting.RemoteInvocationHandler.wrap(RemoteInvocationHandler.java:105)
at hudson.remoting.Channel.export(Channel.java:592)
at hudson.remoting.Channel.export(Channel.java:561)
at org.jenkinsci.plugins.gitclient.LegacyCompatibleGitAPIImpl.writeReplace(LegacyCompatibleGitAPIImpl.java:201)
at sun.reflect.NativeMethodAccessorImpl.invoke0(Native Method)
at sun.reflect.NativeMethodAccessorImpl.invoke(NativeMethodAccessorImpl.java:57)
at sun.reflect.DelegatingMethodAccessorImpl.invoke(DelegatingMethodAccessorImpl.java:43)
at java.lang.reflect.Method.invoke(Method.java:606)
at java.io.ObjectStreamClass.invokeWriteReplace(ObjectStreamClass.java:1075)
at java.io.ObjectOutputStream.writeObject0(ObjectOutputStream.java:1134)
at java.io.ObjectOutputStream.writeObject(ObjectOutputStream.java:347)
at hudson.remoting.UserRequest._serialize(UserRequest.java:158)
at hudson.remoting.UserRequest.serialize(UserRequest.java:167)
at hudson.remoting.UserRequest.perform(UserRequest.java:129)
at hudson.remoting.UserRequest.perform(UserRequest.java:49)
at hudson.remoting.Request$2.run(Request.java:324)
at hudson.remoting.InterceptingExecutorService$1.call(InterceptingExecutorService.java:68)
at java.util.concurrent.FutureTask.run(FutureTask.java:262)
at java.util.concurrent.ThreadPoolExecutor.runWorker(ThreadPoolExecutor.java:1145)
at java.util.concurrent.ThreadPoolExecutor$Worker.run(ThreadPoolExecutor.java:615)
at hudson.remoting.Engine$1$1.run(Engine.java:63)
at java.lang.Thread.run(Thread.java:745)
at ......remote call to dev133-virt2(Native Method)
at hudson.remoting.Channel.attachCallSiteStackTrace(Channel.java:1356)
at hudson.remoting.UserResponse.retrieve(UserRequest.java:221)
at hudson.remoting.Channel.call(Channel.java:752)
... 15 more
Retrying after 10 seconds
java.io.IOException: remote file operation failed: <http://jenkins.mw.lab.eng.bos.redhat.com/hudson/job/SwitchYard-Tools-2.0....> at hudson.remoting.Channel@22ca4fe4:dev133-virt2: java.io.IOException: Remote call on dev133-virt2 failed
at hudson.FilePath.act(FilePath.java:976)
at hudson.FilePath.act(FilePath.java:958)
at org.jenkinsci.plugins.gitclient.Git.getClient(Git.java:131)
at hudson.plugins.git.GitSCM.createClient(GitSCM.java:677)
at hudson.plugins.git.GitSCM.createClient(GitSCM.java:669)
at hudson.plugins.git.GitSCM.checkout(GitSCM.java:1010)
at hudson.scm.SCM.checkout(SCM.java:484)
at hudson.model.AbstractProject.checkout(AbstractProject.java:1257)
at hudson.model.AbstractBuild$AbstractBuildExecution.defaultCheckout(AbstractBuild.java:622)
at jenkins.scm.SCMCheckoutStrategy.checkout(SCMCheckoutStrategy.java:86)
at hudson.model.AbstractBuild$AbstractBuildExecution.run(AbstractBuild.java:528)
at hudson.model.Run.execute(Run.java:1745)
at hudson.model.FreeStyleBuild.run(FreeStyleBuild.java:43)
at hudson.model.ResourceController.execute(ResourceController.java:89)
at hudson.model.Executor.run(Executor.java:240)
Caused by: java.io.IOException: Remote call on dev133-virt2 failed
at hudson.remoting.Channel.call(Channel.java:760)
at hudson.FilePath.act(FilePath.java:969)
... 14 more
Caused by: java.lang.NoClassDefFoundError: Could not initialize class com.sun.proxy.$Proxy12
at sun.reflect.NativeConstructorAccessorImpl.newInstance0(Native Method)
at sun.reflect.NativeConstructorAccessorImpl.newInstance(NativeConstructorAccessorImpl.java:57)
at sun.reflect.DelegatingConstructorAccessorImpl.newInstance(DelegatingConstructorAccessorImpl.java:45)
at java.lang.reflect.Constructor.newInstance(Constructor.java:526)
at java.lang.reflect.Proxy.newInstance(Proxy.java:764)
at java.lang.reflect.Proxy.newProxyInstance(Proxy.java:755)
at hudson.remoting.RemoteInvocationHandler.wrap(RemoteInvocationHandler.java:105)
at hudson.remoting.Channel.export(Channel.java:592)
at hudson.remoting.Channel.export(Channel.java:561)
at org.jenkinsci.plugins.gitclient.LegacyCompatibleGitAPIImpl.writeReplace(LegacyCompatibleGitAPIImpl.java:201)
at sun.reflect.NativeMethodAccessorImpl.invoke0(Native Method)
at sun.reflect.NativeMethodAccessorImpl.invoke(NativeMethodAccessorImpl.java:57)
at sun.reflect.DelegatingMethodAccessorImpl.invoke(DelegatingMethodAccessorImpl.java:43)
at java.lang.reflect.Method.invoke(Method.java:606)
at java.io.ObjectStreamClass.invokeWriteReplace(ObjectStreamClass.java:1075)
at java.io.ObjectOutputStream.writeObject0(ObjectOutputStream.java:1134)
at java.io.ObjectOutputStream.writeObject(ObjectOutputStream.java:347)
at hudson.remoting.UserRequest._serialize(UserRequest.java:158)
at hudson.remoting.UserRequest.serialize(UserRequest.java:167)
at hudson.remoting.UserRequest.perform(UserRequest.java:129)
at hudson.remoting.UserRequest.perform(UserRequest.java:49)
at hudson.remoting.Request$2.run(Request.java:324)
at hudson.remoting.InterceptingExecutorService$1.call(InterceptingExecutorService.java:68)
at java.util.concurrent.FutureTask.run(FutureTask.java:262)
at java.util.concurrent.ThreadPoolExecutor.runWorker(ThreadPoolExecutor.java:1145)
at java.util.concurrent.ThreadPoolExecutor$Worker.run(ThreadPoolExecutor.java:615)
at hudson.remoting.Engine$1$1.run(Engine.java:63)
at java.lang.Thread.run(Thread.java:745)
at ......remote call to dev133-virt2(Native Method)
at hudson.remoting.Channel.attachCallSiteStackTrace(Channel.java:1356)
at hudson.remoting.UserResponse.retrieve(UserRequest.java:221)
at hudson.remoting.Channel.call(Channel.java:752)
... 15 more
Retrying after 10 seconds
java.io.IOException: remote file operation failed: <http://jenkins.mw.lab.eng.bos.redhat.com/hudson/job/SwitchYard-Tools-2.0....> at hudson.remoting.Channel@22ca4fe4:dev133-virt2: java.io.IOException: Remote call on dev133-virt2 failed
at hudson.FilePath.act(FilePath.java:976)
at hudson.FilePath.act(FilePath.java:958)
at org.jenkinsci.plugins.gitclient.Git.getClient(Git.java:131)
at hudson.plugins.git.GitSCM.createClient(GitSCM.java:677)
at hudson.plugins.git.GitSCM.createClient(GitSCM.java:669)
at hudson.plugins.git.GitSCM.checkout(GitSCM.java:1010)
at hudson.scm.SCM.checkout(SCM.java:484)
at hudson.model.AbstractProject.checkout(AbstractProject.java:1257)
at hudson.model.AbstractBuild$AbstractBuildExecution.defaultCheckout(AbstractBuild.java:622)
at jenkins.scm.SCMCheckoutStrategy.checkout(SCMCheckoutStrategy.java:86)
at hudson.model.AbstractBuild$AbstractBuildExecution.run(AbstractBuild.java:528)
at hudson.model.Run.execute(Run.java:1745)
at hudson.model.FreeStyleBuild.run(FreeStyleBuild.java:43)
at hudson.model.ResourceController.execute(ResourceController.java:89)
at hudson.model.Executor.run(Executor.java:240)
Caused by: java.io.IOException: Remote call on dev133-virt2 failed
at hudson.remoting.Channel.call(Channel.java:760)
at hudson.FilePath.act(FilePath.java:969)
... 14 more
Caused by: java.lang.NoClassDefFoundError: Could not initialize class com.sun.proxy.$Proxy12
at sun.reflect.NativeConstructorAccessorImpl.newInstance0(Native Method)
at sun.reflect.NativeConstructorAccessorImpl.newInstance(NativeConstructorAccessorImpl.java:57)
at sun.reflect.DelegatingConstructorAccessorImpl.newInstance(DelegatingConstructorAccessorImpl.java:45)
at java.lang.reflect.Constructor.newInstance(Constructor.java:526)
at java.lang.reflect.Proxy.newInstance(Proxy.java:764)
at java.lang.reflect.Proxy.newProxyInstance(Proxy.java:755)
at hudson.remoting.RemoteInvocationHandler.wrap(RemoteInvocationHandler.java:105)
at hudson.remoting.Channel.export(Channel.java:592)
at hudson.remoting.Channel.export(Channel.java:561)
at org.jenkinsci.plugins.gitclient.LegacyCompatibleGitAPIImpl.writeReplace(LegacyCompatibleGitAPIImpl.java:201)
at sun.reflect.NativeMethodAccessorImpl.invoke0(Native Method)
at sun.reflect.NativeMethodAccessorImpl.invoke(NativeMethodAccessorImpl.java:57)
at sun.reflect.DelegatingMethodAccessorImpl.invoke(DelegatingMethodAccessorImpl.java:43)
at java.lang.reflect.Method.invoke(Method.java:606)
at java.io.ObjectStreamClass.invokeWriteReplace(ObjectStreamClass.java:1075)
at java.io.ObjectOutputStream.writeObject0(ObjectOutputStream.java:1134)
at java.io.ObjectOutputStream.writeObject(ObjectOutputStream.java:347)
at hudson.remoting.UserRequest._serialize(UserRequest.java:158)
at hudson.remoting.UserRequest.serialize(UserRequest.java:167)
at hudson.remoting.UserRequest.perform(UserRequest.java:129)
at hudson.remoting.UserRequest.perform(UserRequest.java:49)
at hudson.remoting.Request$2.run(Request.java:324)
at hudson.remoting.InterceptingExecutorService$1.call(InterceptingExecutorService.java:68)
at java.util.concurrent.FutureTask.run(FutureTask.java:262)
at java.util.concurrent.ThreadPoolExecutor.runWorker(ThreadPoolExecutor.java:1145)
at java.util.concurrent.ThreadPoolExecutor$Worker.run(ThreadPoolExecutor.java:615)
at hudson.remoting.Engine$1$1.run(Engine.java:63)
at java.lang.Thread.run(Thread.java:745)
at ......remote call to dev133-virt2(Native Method)
at hudson.remoting.Channel.attachCallSiteStackTrace(Channel.java:1356)
at hudson.remoting.UserResponse.retrieve(UserRequest.java:221)
at hudson.remoting.Channel.call(Channel.java:752)
... 15 more
Retrying after 10 seconds
java.io.IOException: remote file operation failed: <http://jenkins.mw.lab.eng.bos.redhat.com/hudson/job/SwitchYard-Tools-2.0....> at hudson.remoting.Channel@22ca4fe4:dev133-virt2: java.io.IOException: Remote call on dev133-virt2 failed
at hudson.FilePath.act(FilePath.java:976)
at hudson.FilePath.act(FilePath.java:958)
at org.jenkinsci.plugins.gitclient.Git.getClient(Git.java:131)
at hudson.plugins.git.GitSCM.createClient(GitSCM.java:677)
at hudson.plugins.git.GitSCM.createClient(GitSCM.java:669)
at hudson.plugins.git.GitSCM.checkout(GitSCM.java:1010)
at hudson.scm.SCM.checkout(SCM.java:484)
at hudson.model.AbstractProject.checkout(AbstractProject.java:1257)
at hudson.model.AbstractBuild$AbstractBuildExecution.defaultCheckout(AbstractBuild.java:622)
at jenkins.scm.SCMCheckoutStrategy.checkout(SCMCheckoutStrategy.java:86)
at hudson.model.AbstractBuild$AbstractBuildExecution.run(AbstractBuild.java:528)
at hudson.model.Run.execute(Run.java:1745)
at hudson.model.FreeStyleBuild.run(FreeStyleBuild.java:43)
at hudson.model.ResourceController.execute(ResourceController.java:89)
at hudson.model.Executor.run(Executor.java:240)
Caused by: java.io.IOException: Remote call on dev133-virt2 failed
at hudson.remoting.Channel.call(Channel.java:760)
at hudson.FilePath.act(FilePath.java:969)
... 14 more
Caused by: java.lang.NoClassDefFoundError: Could not initialize class com.sun.proxy.$Proxy12
at sun.reflect.NativeConstructorAccessorImpl.newInstance0(Native Method)
at sun.reflect.NativeConstructorAccessorImpl.newInstance(NativeConstructorAccessorImpl.java:57)
at sun.reflect.DelegatingConstructorAccessorImpl.newInstance(DelegatingConstructorAccessorImpl.java:45)
at java.lang.reflect.Constructor.newInstance(Constructor.java:526)
at java.lang.reflect.Proxy.newInstance(Proxy.java:764)
at java.lang.reflect.Proxy.newProxyInstance(Proxy.java:755)
at hudson.remoting.RemoteInvocationHandler.wrap(RemoteInvocationHandler.java:105)
at hudson.remoting.Channel.export(Channel.java:592)
at hudson.remoting.Channel.export(Channel.java:561)
at org.jenkinsci.plugins.gitclient.LegacyCompatibleGitAPIImpl.writeReplace(LegacyCompatibleGitAPIImpl.java:201)
at sun.reflect.NativeMethodAccessorImpl.invoke0(Native Method)
at sun.reflect.NativeMethodAccessorImpl.invoke(NativeMethodAccessorImpl.java:57)
at sun.reflect.DelegatingMethodAccessorImpl.invoke(DelegatingMethodAccessorImpl.java:43)
at java.lang.reflect.Method.invoke(Method.java:606)
at java.io.ObjectStreamClass.invokeWriteReplace(ObjectStreamClass.java:1075)
at java.io.ObjectOutputStream.writeObject0(ObjectOutputStream.java:1134)
at java.io.ObjectOutputStream.writeObject(ObjectOutputStream.java:347)
at hudson.remoting.UserRequest._serialize(UserRequest.java:158)
at hudson.remoting.UserRequest.serialize(UserRequest.java:167)
at hudson.remoting.UserRequest.perform(UserRequest.java:129)
at hudson.remoting.UserRequest.perform(UserRequest.java:49)
at hudson.remoting.Request$2.run(Request.java:324)
at hudson.remoting.InterceptingExecutorService$1.call(InterceptingExecutorService.java:68)
at java.util.concurrent.FutureTask.run(FutureTask.java:262)
at java.util.concurrent.ThreadPoolExecutor.runWorker(ThreadPoolExecutor.java:1145)
at java.util.concurrent.ThreadPoolExecutor$Worker.run(ThreadPoolExecutor.java:615)
at hudson.remoting.Engine$1$1.run(Engine.java:63)
at java.lang.Thread.run(Thread.java:745)
at ......remote call to dev133-virt2(Native Method)
at hudson.remoting.Channel.attachCallSiteStackTrace(Channel.java:1356)
at hudson.remoting.UserResponse.retrieve(UserRequest.java:221)
at hudson.remoting.Channel.call(Channel.java:752)
... 15 more
Archiving artifacts
Recording test results
ERROR: Publisher hudson.tasks.junit.JUnitResultArchiver aborted due to exception
hudson.AbortException: No test report files were found. Configuration error?
at hudson.tasks.junit.JUnitParser$ParseResultCallable.invoke(JUnitParser.java:116)
at hudson.tasks.junit.JUnitParser$ParseResultCallable.invoke(JUnitParser.java:93)
at hudson.FilePath$FileCallableWrapper.call(FilePath.java:2589)
at hudson.remoting.UserRequest.perform(UserRequest.java:121)
at hudson.remoting.UserRequest.perform(UserRequest.java:49)
at hudson.remoting.Request$2.run(Request.java:324)
at hudson.remoting.InterceptingExecutorService$1.call(InterceptingExecutorService.java:68)
at java.util.concurrent.FutureTask.run(FutureTask.java:262)
at java.util.concurrent.ThreadPoolExecutor.runWorker(ThreadPoolExecutor.java:1145)
at java.util.concurrent.ThreadPoolExecutor$Worker.run(ThreadPoolExecutor.java:615)
at hudson.remoting.Engine$1$1.run(Engine.java:63)
at java.lang.Thread.run(Thread.java:745)
at ......remote call to dev133-virt2(Native Method)
at hudson.remoting.Channel.attachCallSiteStackTrace(Channel.java:1356)
at hudson.remoting.UserResponse.retrieve(UserRequest.java:221)
at hudson.remoting.Channel.call(Channel.java:752)
at hudson.FilePath.act(FilePath.java:969)
at hudson.FilePath.act(FilePath.java:958)
at hudson.tasks.junit.JUnitParser.parseResult(JUnitParser.java:90)
at hudson.tasks.junit.JUnitResultArchiver.parse(JUnitResultArchiver.java:120)
at hudson.tasks.junit.JUnitResultArchiver.perform(JUnitResultArchiver.java:137)
at hudson.tasks.BuildStepCompatibilityLayer.perform(BuildStepCompatibilityLayer.java:74)
at hudson.tasks.BuildStepMonitor$1.perform(BuildStepMonitor.java:20)
at hudson.model.AbstractBuild$AbstractBuildExecution.perform(AbstractBuild.java:770)
at hudson.model.AbstractBuild$AbstractBuildExecution.performAllBuildSteps(AbstractBuild.java:734)
at hudson.model.Build$BuildExecution.post2(Build.java:183)
at hudson.model.AbstractBuild$AbstractBuildExecution.post(AbstractBuild.java:683)
at hudson.model.Run.execute(Run.java:1770)
at hudson.model.FreeStyleBuild.run(FreeStyleBuild.java:43)
at hudson.model.ResourceController.execute(ResourceController.java:89)
at hudson.model.Executor.run(Executor.java:240)
9 years, 1 month
Build failed in Jenkins: SwitchYard-Release #1667
by ci-builds@redhat.com
See <http://jenkins.mw.lab.eng.bos.redhat.com/hudson/job/SwitchYard-Release/1667/>
------------------------------------------
[...truncated 3022 lines...]
[INFO] Deleting <http://jenkins.mw.lab.eng.bos.redhat.com/hudson/job/SwitchYard-Release/ws...>
[INFO]
[INFO] --- maven-enforcer-plugin:1.3.1:enforce (enforce-java-version) @ switchyard-deploy-jboss-as7 ---
[INFO]
[INFO] --- maven-enforcer-plugin:1.3.1:enforce (enforce-maven-version) @ switchyard-deploy-jboss-as7 ---
[INFO]
[INFO] --- maven-enforcer-plugin:1.3.1:enforce (ban-uberjars) @ switchyard-deploy-jboss-as7 ---
[INFO]
[INFO] --- maven-enforcer-plugin:1.3.1:enforce (no-managed-deps) @ switchyard-deploy-jboss-as7 ---
[INFO]
[INFO] --- buildnumber-maven-plugin:1.2:create-timestamp (get-build-timestamp) @ switchyard-deploy-jboss-as7 ---
[INFO]
[INFO] --- buildnumber-maven-plugin:1.2:create (get-scm-revision) @ switchyard-deploy-jboss-as7 ---
[INFO]
[INFO] --- maven-bundle-plugin:2.4.0:cleanVersions (cleanVersions) @ switchyard-deploy-jboss-as7 ---
[INFO]
[INFO] --- maven-resources-plugin:2.4.3:resources (default-resources) @ switchyard-deploy-jboss-as7 ---
[INFO] Using 'UTF-8' encoding to copy filtered resources.
[INFO] Copying 10 resources
[INFO]
[INFO] --- maven-compiler-plugin:2.3.2:compile (default-compile) @ switchyard-deploy-jboss-as7 ---
[INFO] Compiling 66 source files to <http://jenkins.mw.lab.eng.bos.redhat.com/hudson/job/SwitchYard-Release/ws...>
[WARNING] bootstrap class path not set in conjunction with -source 1.6
<http://jenkins.mw.lab.eng.bos.redhat.com/hudson/job/SwitchYard-Release/ws...>:[6,24] [deprecation] Cause in org.jboss.logging has been deprecated
[WARNING] <http://jenkins.mw.lab.eng.bos.redhat.com/hudson/job/SwitchYard-Release/ws...>:[6,24] [deprecation] Cause in org.jboss.logging has been deprecated
[WARNING] <http://jenkins.mw.lab.eng.bos.redhat.com/hudson/job/SwitchYard-Release/ws...>:[71,85] [deprecation] Cause in org.jboss.logging has been deprecated
[WARNING] <http://jenkins.mw.lab.eng.bos.redhat.com/hudson/job/SwitchYard-Release/ws...>:[96,63] [deprecation] Cause in org.jboss.logging has been deprecated
[WARNING] <http://jenkins.mw.lab.eng.bos.redhat.com/hudson/job/SwitchYard-Release/ws...>:[33,52] [deprecation] Cause in org.jboss.logging has been deprecated
[WARNING] <http://jenkins.mw.lab.eng.bos.redhat.com/hudson/job/SwitchYard-Release/ws...>:[49,53] [deprecation] Cause in org.jboss.logging has been deprecated
[WARNING] <http://jenkins.mw.lab.eng.bos.redhat.com/hudson/job/SwitchYard-Release/ws...>:[58,54] [deprecation] Cause in org.jboss.logging has been deprecated
[WARNING] <http://jenkins.mw.lab.eng.bos.redhat.com/hudson/job/SwitchYard-Release/ws...>:[67,46] [deprecation] Cause in org.jboss.logging has been deprecated
[WARNING] <http://jenkins.mw.lab.eng.bos.redhat.com/hudson/job/SwitchYard-Release/ws...>:[76,46] [deprecation] Cause in org.jboss.logging has been deprecated
[WARNING] <http://jenkins.mw.lab.eng.bos.redhat.com/hudson/job/SwitchYard-Release/ws...>:[85,45] [deprecation] Cause in org.jboss.logging has been deprecated
[WARNING] <http://jenkins.mw.lab.eng.bos.redhat.com/hudson/job/SwitchYard-Release/ws...>:[94,48] [deprecation] Cause in org.jboss.logging has been deprecated
[WARNING] <http://jenkins.mw.lab.eng.bos.redhat.com/hudson/job/SwitchYard-Release/ws...>:[103,39] [deprecation] Cause in org.jboss.logging has been deprecated
[WARNING] <http://jenkins.mw.lab.eng.bos.redhat.com/hudson/job/SwitchYard-Release/ws...>:[6,24] [deprecation] Cause in org.jboss.logging has been deprecated
[WARNING] <http://jenkins.mw.lab.eng.bos.redhat.com/hudson/job/SwitchYard-Release/ws...>:[6,24] [deprecation] Cause in org.jboss.logging has been deprecated
[WARNING] <http://jenkins.mw.lab.eng.bos.redhat.com/hudson/job/SwitchYard-Release/ws...>:[71,85] [deprecation] Cause in org.jboss.logging has been deprecated
[WARNING] <http://jenkins.mw.lab.eng.bos.redhat.com/hudson/job/SwitchYard-Release/ws...>:[96,63] [deprecation] Cause in org.jboss.logging has been deprecated
[WARNING] <http://jenkins.mw.lab.eng.bos.redhat.com/hudson/job/SwitchYard-Release/ws...>:[33,52] [deprecation] Cause in org.jboss.logging has been deprecated
[WARNING] <http://jenkins.mw.lab.eng.bos.redhat.com/hudson/job/SwitchYard-Release/ws...>:[49,53] [deprecation] Cause in org.jboss.logging has been deprecated
[WARNING] <http://jenkins.mw.lab.eng.bos.redhat.com/hudson/job/SwitchYard-Release/ws...>:[58,54] [deprecation] Cause in org.jboss.logging has been deprecated
[WARNING] <http://jenkins.mw.lab.eng.bos.redhat.com/hudson/job/SwitchYard-Release/ws...>:[67,46] [deprecation] Cause in org.jboss.logging has been deprecated
[WARNING] <http://jenkins.mw.lab.eng.bos.redhat.com/hudson/job/SwitchYard-Release/ws...>:[76,46] [deprecation] Cause in org.jboss.logging has been deprecated
[WARNING] <http://jenkins.mw.lab.eng.bos.redhat.com/hudson/job/SwitchYard-Release/ws...>:[85,45] [deprecation] Cause in org.jboss.logging has been deprecated
[WARNING] <http://jenkins.mw.lab.eng.bos.redhat.com/hudson/job/SwitchYard-Release/ws...>:[94,48] [deprecation] Cause in org.jboss.logging has been deprecated
[WARNING] <http://jenkins.mw.lab.eng.bos.redhat.com/hudson/job/SwitchYard-Release/ws...>:[103,39] [deprecation] Cause in org.jboss.logging has been deprecated
[WARNING] <http://jenkins.mw.lab.eng.bos.redhat.com/hudson/job/SwitchYard-Release/ws...>:[6,24] [deprecation] Cause in org.jboss.logging has been deprecated
[WARNING] <http://jenkins.mw.lab.eng.bos.redhat.com/hudson/job/SwitchYard-Release/ws...>:[6,24] [deprecation] Cause in org.jboss.logging has been deprecated
[WARNING] <http://jenkins.mw.lab.eng.bos.redhat.com/hudson/job/SwitchYard-Release/ws...>:[71,85] [deprecation] Cause in org.jboss.logging has been deprecated
[WARNING] <http://jenkins.mw.lab.eng.bos.redhat.com/hudson/job/SwitchYard-Release/ws...>:[96,63] [deprecation] Cause in org.jboss.logging has been deprecated
[WARNING] <http://jenkins.mw.lab.eng.bos.redhat.com/hudson/job/SwitchYard-Release/ws...>:[33,52] [deprecation] Cause in org.jboss.logging has been deprecated
[WARNING] <http://jenkins.mw.lab.eng.bos.redhat.com/hudson/job/SwitchYard-Release/ws...>:[49,53] [deprecation] Cause in org.jboss.logging has been deprecated
[WARNING] <http://jenkins.mw.lab.eng.bos.redhat.com/hudson/job/SwitchYard-Release/ws...>:[58,54] [deprecation] Cause in org.jboss.logging has been deprecated
[WARNING] <http://jenkins.mw.lab.eng.bos.redhat.com/hudson/job/SwitchYard-Release/ws...>:[67,46] [deprecation] Cause in org.jboss.logging has been deprecated
[WARNING] <http://jenkins.mw.lab.eng.bos.redhat.com/hudson/job/SwitchYard-Release/ws...>:[76,46] [deprecation] Cause in org.jboss.logging has been deprecated
[WARNING] <http://jenkins.mw.lab.eng.bos.redhat.com/hudson/job/SwitchYard-Release/ws...>:[85,45] [deprecation] Cause in org.jboss.logging has been deprecated
[WARNING] <http://jenkins.mw.lab.eng.bos.redhat.com/hudson/job/SwitchYard-Release/ws...>:[94,48] [deprecation] Cause in org.jboss.logging has been deprecated
[WARNING] <http://jenkins.mw.lab.eng.bos.redhat.com/hudson/job/SwitchYard-Release/ws...>:[103,39] [deprecation] Cause in org.jboss.logging has been deprecated
[WARNING] <http://jenkins.mw.lab.eng.bos.redhat.com/hudson/job/SwitchYard-Release/ws...>:[6,24] [deprecation] Cause in org.jboss.logging has been deprecated
[WARNING] <http://jenkins.mw.lab.eng.bos.redhat.com/hudson/job/SwitchYard-Release/ws...>:[6,24] [deprecation] Cause in org.jboss.logging has been deprecated
[WARNING] <http://jenkins.mw.lab.eng.bos.redhat.com/hudson/job/SwitchYard-Release/ws...>:[71,85] [deprecation] Cause in org.jboss.logging has been deprecated
[WARNING] <http://jenkins.mw.lab.eng.bos.redhat.com/hudson/job/SwitchYard-Release/ws...>:[96,63] [deprecation] Cause in org.jboss.logging has been deprecated
[WARNING] <http://jenkins.mw.lab.eng.bos.redhat.com/hudson/job/SwitchYard-Release/ws...>:[33,52] [deprecation] Cause in org.jboss.logging has been deprecated
[WARNING] <http://jenkins.mw.lab.eng.bos.redhat.com/hudson/job/SwitchYard-Release/ws...>:[49,53] [deprecation] Cause in org.jboss.logging has been deprecated
[WARNING] <http://jenkins.mw.lab.eng.bos.redhat.com/hudson/job/SwitchYard-Release/ws...>:[58,54] [deprecation] Cause in org.jboss.logging has been deprecated
[WARNING] <http://jenkins.mw.lab.eng.bos.redhat.com/hudson/job/SwitchYard-Release/ws...>:[67,46] [deprecation] Cause in org.jboss.logging has been deprecated
[WARNING] <http://jenkins.mw.lab.eng.bos.redhat.com/hudson/job/SwitchYard-Release/ws...>:[76,46] [deprecation] Cause in org.jboss.logging has been deprecated
[WARNING] <http://jenkins.mw.lab.eng.bos.redhat.com/hudson/job/SwitchYard-Release/ws...>:[85,45] [deprecation] Cause in org.jboss.logging has been deprecated
[WARNING] <http://jenkins.mw.lab.eng.bos.redhat.com/hudson/job/SwitchYard-Release/ws...>:[94,48] [deprecation] Cause in org.jboss.logging has been deprecated
[WARNING] <http://jenkins.mw.lab.eng.bos.redhat.com/hudson/job/SwitchYard-Release/ws...>:[103,39] [deprecation] Cause in org.jboss.logging has been deprecated
[WARNING] <http://jenkins.mw.lab.eng.bos.redhat.com/hudson/job/SwitchYard-Release/ws...>:[182,61] [deprecation] OPTIONAL in DependencyType has been deprecated
[WARNING] <http://jenkins.mw.lab.eng.bos.redhat.com/hudson/job/SwitchYard-Release/ws...>:[46,44] [deprecation] getChild(URL) in VFS has been deprecated
[WARNING] <http://jenkins.mw.lab.eng.bos.redhat.com/hudson/job/SwitchYard-Release/ws...>:[126,45] [deprecation] OPTIONAL in DependencyType has been deprecated
[INFO]
[INFO] --- maven-enforcer-plugin:1.3.1:enforce (enforce-direct-dependencies) @ switchyard-deploy-jboss-as7 ---
[INFO] Flag 'useClassesFromLastBuild' is set. Try to use existing output folder.
[INFO] Analyze dependencies of artifact 'org.switchyard:switchyard-deploy-jboss-as7:jar:2.0.0.Final'.
[INFO] Artifact 'org.switchyard.quickstarts:switchyard-ear-deployment-ear-assembly:ear:2.0.0.Final:test' associated file '<http://jenkins.mw.lab.eng.bos.redhat.com/hudson/job/SwitchYard-Release/ws...',> is skipped.
[INFO] No illegal transitive dependencies found in 'org.switchyard:switchyard-deploy-jboss-as7:jar:2.0.0.Final'.
[INFO]
[INFO] --- maven-resources-plugin:2.4.3:testResources (default-testResources) @ switchyard-deploy-jboss-as7 ---
[INFO] Using 'UTF-8' encoding to copy filtered resources.
[INFO] skip non existing resourceDirectory <http://jenkins.mw.lab.eng.bos.redhat.com/hudson/job/SwitchYard-Release/ws...>
[INFO]
[INFO] --- maven-compiler-plugin:2.3.2:testCompile (default-testCompile) @ switchyard-deploy-jboss-as7 ---
[INFO] No sources to compile
[INFO]
[INFO] --- maven-surefire-plugin:2.6:test (default-test) @ switchyard-deploy-jboss-as7 ---
[INFO] No tests to run.
[INFO] Surefire report directory: <http://jenkins.mw.lab.eng.bos.redhat.com/hudson/job/SwitchYard-Release/ws...>
-------------------------------------------------------
T E S T S
-------------------------------------------------------
There are no tests to run.
Results :
Tests run: 0, Failures: 0, Errors: 0, Skipped: 0
[INFO]
[INFO] --- maven-jar-plugin:2.3.1:jar (default-jar) @ switchyard-deploy-jboss-as7 ---
[INFO] Building jar: <http://jenkins.mw.lab.eng.bos.redhat.com/hudson/job/SwitchYard-Release/ws...>
[INFO]
[INFO] --- maven-source-plugin:2.1.1:jar-no-fork (attach-sources) @ switchyard-deploy-jboss-as7 ---
[INFO] Building jar: <http://jenkins.mw.lab.eng.bos.redhat.com/hudson/job/SwitchYard-Release/ws...>
[INFO]
[INFO] --- maven-install-plugin:2.4:install (default-install) @ switchyard-deploy-jboss-as7 ---
[INFO] Installing <http://jenkins.mw.lab.eng.bos.redhat.com/hudson/job/SwitchYard-Release/ws...> to <http://jenkins.mw.lab.eng.bos.redhat.com/hudson/job/SwitchYard-Release/ws...>
[INFO] Installing <http://jenkins.mw.lab.eng.bos.redhat.com/hudson/job/SwitchYard-Release/ws...> to <http://jenkins.mw.lab.eng.bos.redhat.com/hudson/job/SwitchYard-Release/ws...>
[INFO] Installing <http://jenkins.mw.lab.eng.bos.redhat.com/hudson/job/SwitchYard-Release/ws...> to <http://jenkins.mw.lab.eng.bos.redhat.com/hudson/job/SwitchYard-Release/ws...>
[INFO]
[INFO] ------------------------------------------------------------------------
[INFO] Building SwitchYard: AS7 Modules 2.0.0.Final
[INFO] ------------------------------------------------------------------------
Downloading: https://repository.jboss.org/nexus/content/repositories/deprecated/tranql...
Downloading: https://repository.jboss.org/nexus/content/groups/developer/tranql/tranql...
Downloading: http://snapshots.jboss.org/maven2/tranql/tranql-connector/1.2/tranql-conn...
Downloading: http://repository.jboss.org/maven2/tranql/tranql-connector/1.2/tranql-con...
Downloading: https://repository.jboss.org/nexus/content/groups/public/tranql/tranql-co...
Downloading: https://repository.jboss.org/nexus/content/repositories/deprecated/tranql...
Downloading: http://maven.repository.redhat.com/techpreview/all/tranql/tranql-connecto...
Downloading: https://repository.jboss.org/nexus/content/repositories/fs-releases/tranq...
Downloading: http://repo1.maven.org/maven2/tranql/tranql-connector/1.2/tranql-connecto...
Downloading: http://maven.repository.redhat.com/techpreview/all/tranql/tranql-connecto...
[WARNING] The POM for tranql:tranql-connector:jar:1.2 is missing, no dependency information available
Downloading: https://repository.jboss.org/nexus/content/repositories/deprecated/org/fu...
Downloading: https://repository.jboss.org/nexus/content/groups/developer/org/fusesourc...
Downloading: http://snapshots.jboss.org/maven2/org/fusesource/camel-sap/6.2.0.redhat-0...
Downloading: http://repository.jboss.org/maven2/org/fusesource/camel-sap/6.2.0.redhat-...
Downloading: https://repository.jboss.org/nexus/content/groups/public/org/fusesource/c...
Downloading: https://repository.jboss.org/nexus/content/repositories/deprecated/org/fu...
Downloading: http://maven.repository.redhat.com/techpreview/all/org/fusesource/camel-s...
Downloading: https://repository.jboss.org/nexus/content/repositories/fs-releases/org/f...
Downloading: http://repo1.maven.org/maven2/org/fusesource/camel-sap/6.2.0.redhat-064/c...
[WARNING] The POM for org.fusesource:camel-sap:jar:6.2.0.redhat-064 is missing, no dependency information available
Downloading: https://repository.jboss.org/nexus/content/repositories/deprecated/org/fu...
Downloading: https://repository.jboss.org/nexus/content/groups/developer/org/fusesourc...
Downloading: http://snapshots.jboss.org/maven2/org/fusesource/camel-sap/6.2.0.redhat-0...
Downloading: http://repository.jboss.org/maven2/org/fusesource/camel-sap/6.2.0.redhat-...
Downloading: https://repository.jboss.org/nexus/content/groups/public/org/fusesource/c...
Downloading: https://repository.jboss.org/nexus/content/repositories/deprecated/org/fu...
Downloading: http://maven.repository.redhat.com/techpreview/all/org/fusesource/camel-s...
Downloading: https://repository.jboss.org/nexus/content/repositories/fs-releases/org/f...
Downloading: http://repo1.maven.org/maven2/org/fusesource/camel-sap/6.2.0.redhat-064/c...
[INFO] ------------------------------------------------------------------------
[INFO] Reactor Summary:
[INFO]
[INFO] SwitchYard: Distribution .......................... SUCCESS [8.081s]
[INFO] SwitchYard: Release Distribution Tests Utilities .. SUCCESS [10.860s]
[INFO] SwitchYard: Distribution Artifacts ................ SUCCESS [1.105s]
[INFO] SwitchYard: Tools Distribution .................... SUCCESS [8.856s]
[INFO] SwitchYard: RHQ Plugin ............................ SUCCESS [6.317s]
[INFO] SwitchYard: Container Parent ...................... SUCCESS [4.568s]
[INFO] SwitchYard: AS7 Extension ......................... SUCCESS [20.946s]
[INFO] SwitchYard: AS7 Modules ........................... FAILURE [17.610s]
[INFO] SwitchYard: AS7 Bundle ............................ SKIPPED
[INFO] SwitchYard: Installer ............................. SKIPPED
[INFO] SwitchYard: AS7 Release Distribution Tests ........ SKIPPED
[INFO] SwitchYard: AS7 Standalone Parent ................. SKIPPED
[INFO] SwitchYard: AS7 Distribution ...................... SKIPPED
[INFO] SwitchYard: Karaf ................................. SKIPPED
[INFO] SwitchYard: Karaf Deployer ........................ SKIPPED
[INFO] SwitchYard: Karaf Commands ........................ SKIPPED
[INFO] SwitchYard: BPEL Component Bundle for Karaf ....... SKIPPED
[INFO] SwitchYard: Karaf Features ........................ SKIPPED
[INFO] SwitchYard: Karaf Tests ........................... SKIPPED
[INFO] ------------------------------------------------------------------------
[INFO] BUILD FAILURE
[INFO] ------------------------------------------------------------------------
[INFO] Total time: 1:25.794s
[INFO] Finished at: Sat Jun 13 13:55:59 EDT 2015
[INFO] Final Memory: 155M/376M
[INFO] ------------------------------------------------------------------------
[ERROR] Failed to execute goal on project switchyard-as7-modules: Could not resolve dependencies for project org.switchyard:switchyard-as7-modules:jar:2.0.0.Final: Could not find artifact org.fusesource:camel-sap:jar:6.2.0.redhat-064 in jboss-deprecated (https://repository.jboss.org/nexus/content/repositories/deprecated/) -> [Help 1]
[ERROR]
[ERROR] To see the full stack trace of the errors, re-run Maven with the -e switch.
[ERROR] Re-run Maven using the -X switch to enable full debug logging.
[ERROR]
[ERROR] For more information about the errors and possible solutions, please read the following articles:
[ERROR] [Help 1] http://cwiki.apache.org/confluence/display/MAVEN/DependencyResolutionExce...
[ERROR]
[ERROR] After correcting the problems, you can resume the build with the command
[ERROR] mvn <goals> -rf :switchyard-as7-modules
Build step 'Invoke top-level Maven targets' marked build as failure
Archiving artifacts
Recording test results
ERROR: Publisher hudson.tasks.junit.JUnitResultArchiver aborted due to exception
hudson.AbortException: No test report files were found. Configuration error?
at hudson.tasks.junit.JUnitParser$ParseResultCallable.invoke(JUnitParser.java:116)
at hudson.tasks.junit.JUnitParser$ParseResultCallable.invoke(JUnitParser.java:93)
at hudson.FilePath$FileCallableWrapper.call(FilePath.java:2589)
at hudson.remoting.UserRequest.perform(UserRequest.java:118)
at hudson.remoting.UserRequest.perform(UserRequest.java:48)
at hudson.remoting.Request$2.run(Request.java:328)
at hudson.remoting.InterceptingExecutorService$1.call(InterceptingExecutorService.java:72)
at java.util.concurrent.FutureTask$Sync.innerRun(FutureTask.java:303)
at java.util.concurrent.FutureTask.run(FutureTask.java:138)
at java.util.concurrent.ThreadPoolExecutor$Worker.runTask(ThreadPoolExecutor.java:895)
at java.util.concurrent.ThreadPoolExecutor$Worker.run(ThreadPoolExecutor.java:918)
at java.lang.Thread.run(Thread.java:662)
at ......remote call to dev83-rhel6-x86_64(Native Method)
at hudson.remoting.Channel.attachCallSiteStackTrace(Channel.java:1356)
at hudson.remoting.UserResponse.retrieve(UserRequest.java:221)
at hudson.remoting.Channel.call(Channel.java:752)
at hudson.FilePath.act(FilePath.java:969)
at hudson.FilePath.act(FilePath.java:958)
at hudson.tasks.junit.JUnitParser.parseResult(JUnitParser.java:90)
at hudson.tasks.junit.JUnitResultArchiver.parse(JUnitResultArchiver.java:120)
at hudson.tasks.junit.JUnitResultArchiver.perform(JUnitResultArchiver.java:137)
at hudson.tasks.BuildStepCompatibilityLayer.perform(BuildStepCompatibilityLayer.java:74)
at hudson.tasks.BuildStepMonitor$1.perform(BuildStepMonitor.java:20)
at hudson.model.AbstractBuild$AbstractBuildExecution.perform(AbstractBuild.java:770)
at hudson.model.AbstractBuild$AbstractBuildExecution.performAllBuildSteps(AbstractBuild.java:734)
at hudson.model.Build$BuildExecution.post2(Build.java:183)
at hudson.model.AbstractBuild$AbstractBuildExecution.post(AbstractBuild.java:683)
at hudson.model.Run.execute(Run.java:1770)
at hudson.model.FreeStyleBuild.run(FreeStyleBuild.java:43)
at hudson.model.ResourceController.execute(ResourceController.java:89)
at hudson.model.Executor.run(Executor.java:240)
9 years, 1 month