See
<
https://fusesource-jenkins.rhev-ci-vms.eng.rdu2.redhat.com/job/Fuse-Tooli...
Changes:
[github] Move master branch to Oxygen / 10.0 (#971)
[github] added launch config for oxygen (#972)
[Lars Heinemann] FUSETOOLS-2390 - fixing issue with create feature (#957)
[Lars Heinemann] FUSETOOLS-2386 - should fix the NPE (#958)
[Lars Heinemann] update Fuse TP to use latest JBT 4.5.0.AM0a from 2017-05-30 (#973)
[Lars Heinemann] Update fuse tp to use latest JBT 4.5.0.AM0a from 2017-05-31 (#974)
[Lars Heinemann] FUSETOOLS-2411 - updating to AM1 TP (#975)
[Brian Fitzpatrick] FUSETOOLS-1585 - beginnings of adding bean support
[Brian Fitzpatrick] FUSETOOLS-1585 - set new java class wizard to not auto-open
[Brian Fitzpatrick] FUSETOOLS-1585 - addressing some of Aurelien's feedback,
[Brian Fitzpatrick] FUSETOOLS-1585 - moving some XML attribute setting/getting code back
to
[Brian Fitzpatrick] FUSETOOLS-1585 - adding more tests and functionality to CamelBean
[Brian Fitzpatrick] FUSETOOLS-1585 - small code improvements
[Brian Fitzpatrick] Fixed issue with refresh
[Brian Fitzpatrick] Fixing issue where src/main/java not created yet
[Brian Fitzpatrick] FUSETOOLS-1585 - Factorize code and leverage java 8 streams
[Brian Fitzpatrick] Attempting to fix test issues with Shells
[Brian Fitzpatrick] Updates to PropertyInputDialogTest as suggested by @apupier
[Brian Fitzpatrick] Update to fix one issue
[Brian Fitzpatrick] fix the swt / cocoa lib failures from CI
[Brian Fitzpatrick] fixes model problem
[Brian Fitzpatrick] Specialize bean extension to not clash with SAP
[Brian Fitzpatrick] Addressing an issue found by the Core model test
------------------------------------------
[...truncated 82525 lines...]
[INFO]
[INFO] --- maven-enforcer-plugin:1.4.1:enforce (enforce-no-snapshots-Final) @
org.fusesource.ide.updatesite ---
[ERROR] Found property jbtis.version = 4.5.0.AM1-SNAPSHOT
[INFO]
[INFO] --- maven-clean-plugin:2.6.1:clean (default-clean-1) @
org.fusesource.ide.updatesite ---
[INFO]
[INFO] --- jacoco-maven-plugin:0.7.9:prepare-agent (default) @
org.fusesource.ide.updatesite ---
[INFO] argLine set to
-javaagent:<https://fusesource-jenkins.rhev-ci-vms.eng.rdu2.redhat.com/job/Fuse-Tooling-pullrequest/ws/.repository/org/jacoco/org.jacoco.agent/0.7.9/org.jacoco.agent-0.7.9-runtime.jar=destfile=/home/jenkins/workspace/target/jacoco.exec,append=true,includes=org.jboss.tools.*>
[INFO]
[INFO] --- jacoco-maven-plugin:0.7.9:prepare-agent (agent-for-ut) @
org.fusesource.ide.updatesite ---
[INFO] argLine set to
-javaagent:<https://fusesource-jenkins.rhev-ci-vms.eng.rdu2.redhat.com/job/Fuse-Tooling-pullrequest/ws/.repository/org/jacoco/org.jacoco.agent/0.7.9/org.jacoco.agent-0.7.9-runtime.jar=destfile=/home/jenkins/target/jacoco.exec,append=true,includes=org.fusesource.ide.*>:org.jboss.tools.fuse.*
[INFO]
[INFO] --- maven-resources-plugin:2.7:resources (default-resources) @
org.fusesource.ide.updatesite ---
[INFO] Using 'UTF-8' encoding to copy filtered resources.
[INFO] skip non existing resourceDirectory
<
https://fusesource-jenkins.rhev-ci-vms.eng.rdu2.redhat.com/job/Fuse-Tooli...
[INFO]
[INFO] --- maven-compiler-plugin:3.5.1:testCompile (compiletests) @
org.fusesource.ide.updatesite ---
[INFO] No sources to compile
[INFO]
[INFO] --- maven-surefire-plugin:2.19.1:test (test) @ org.fusesource.ide.updatesite ---
[INFO] No tests to run.
[INFO]
[INFO] --- tycho-source-plugin:1.0.0:plugin-source (plugin-source) @
org.fusesource.ide.updatesite ---
[INFO]
[INFO] --- target-platform-configuration:1.0.0:target-platform (default-target-platform) @
org.fusesource.ide.updatesite ---
[INFO]
[INFO] --- tycho-p2-publisher-plugin:1.0.0:publish-products (default-publish-products) @
org.fusesource.ide.updatesite ---
[INFO]
[INFO] --- tycho-p2-publisher-plugin:1.0.0:publish-categories (default-publish-categories)
@ org.fusesource.ide.updatesite ---
[INFO]
[INFO] --- tycho-p2-publisher-plugin:1.0.0:attach-artifacts (default-attach-artifacts) @
org.fusesource.ide.updatesite ---
[INFO]
[INFO] --- tycho-p2-repository-plugin:1.0.0:assemble-repository
(default-assemble-repository) @ org.fusesource.ide.updatesite ---
[INFO]
[INFO] --- tycho-p2-repository-plugin:1.0.0:archive-repository
(default-archive-repository) @ org.fusesource.ide.updatesite ---
[INFO] Building zip:
<
https://fusesource-jenkins.rhev-ci-vms.eng.rdu2.redhat.com/job/Fuse-Tooli...
[INFO]
[INFO] --- tycho-source-feature-plugin:1.0.0:source-feature (source-feature) @
org.fusesource.ide.updatesite ---
[INFO]
[INFO] --- tycho-p2-plugin:1.0.0:p2-metadata (attached-p2-metadata) @
org.fusesource.ide.updatesite ---
[INFO]
[INFO] --- repository-utils:1.0.0:generate-repository-facade (generate-facade) @
org.fusesource.ide.updatesite ---
[INFO] Building zip:
<
https://fusesource-jenkins.rhev-ci-vms.eng.rdu2.redhat.com/job/Fuse-Tooli...
[INFO]
[INFO] --- jacoco-maven-plugin:0.7.9:prepare-agent-integration (agent-for-it) @
org.fusesource.ide.updatesite ---
[INFO] argLine set to
-javaagent:<https://fusesource-jenkins.rhev-ci-vms.eng.rdu2.redhat.com/job/Fuse-Tooling-pullrequest/ws/.repository/org/jacoco/org.jacoco.agent/0.7.9/org.jacoco.agent-0.7.9-runtime.jar=destfile=/home/jenkins/target/jacoco-it.exec,append=true,includes=org.fusesource.ide.*>:org.jboss.tools.fuse.*
[INFO]
[INFO] --- jacoco-maven-plugin:0.7.9:report (jacoco-site) @ org.fusesource.ide.updatesite
---
[INFO] Skipping JaCoCo execution due to missing execution data file.
[INFO]
[INFO] --- tycho-p2-extras-plugin:1.0.0:compare-version-with-baselines (default) @
org.fusesource.ide.updatesite ---
[INFO]
[INFO] --- maven-install-plugin:2.3.1:install (default-install) @
org.fusesource.ide.updatesite ---
[INFO] Installing
<
https://fusesource-jenkins.rhev-ci-vms.eng.rdu2.redhat.com/job/Fuse-Tooli...
to
<
https://fusesource-jenkins.rhev-ci-vms.eng.rdu2.redhat.com/job/Fuse-Tooli...
[INFO] Installing
<
https://fusesource-jenkins.rhev-ci-vms.eng.rdu2.redhat.com/job/Fuse-Tooli...
to
<
https://fusesource-jenkins.rhev-ci-vms.eng.rdu2.redhat.com/job/Fuse-Tooli...
[INFO] Installing
<
https://fusesource-jenkins.rhev-ci-vms.eng.rdu2.redhat.com/job/Fuse-Tooli...
to
<
https://fusesource-jenkins.rhev-ci-vms.eng.rdu2.redhat.com/job/Fuse-Tooli...
[INFO] Installing
<
https://fusesource-jenkins.rhev-ci-vms.eng.rdu2.redhat.com/job/Fuse-Tooli...
to
<
https://fusesource-jenkins.rhev-ci-vms.eng.rdu2.redhat.com/job/Fuse-Tooli...
[INFO]
[INFO] --- tycho-p2-plugin:1.0.0:update-local-index (default-update-local-index) @
org.fusesource.ide.updatesite ---
[INFO] ------------------------------------------------------------------------
[INFO] Reactor Summary:
[INFO]
[INFO] JBoss Fuse Tooling :: Build Configuration .......... SUCCESS [ 10.650 s]
[INFO] JBoss Fuse Tooling ................................. SUCCESS [ 21.623 s]
[INFO] JBoss Fuse Tooling :: Tools ........................ SUCCESS [ 0.014 s]
[INFO] JBoss Fuse Tooling :: Tools :: IDE Camel Catalog Generator SUCCESS [01:47 min]
[INFO] JBoss Fuse Tooling :: Core ......................... SUCCESS [ 0.016 s]
[INFO] JBoss Fuse Tooling :: Core :: Plugins .............. SUCCESS [ 0.013 s]
[INFO] JBoss Fuse Tooling :: Core :: Plugins :: Foundation Core SUCCESS [ 26.421 s]
[INFO] JBoss Fuse Tooling :: Core :: Plugins :: Preferences SUCCESS [ 0.806 s]
[INFO] JBoss Fuse Tooling :: Core :: Plugins :: Foundation UI SUCCESS [ 1.809 s]
[INFO] JBoss Fuse Tooling :: Core :: Plugins :: Camel Model Service API SUCCESS [ 11.239
s]
[INFO] JBoss Fuse Tooling :: Core :: Plugins :: Camel 2.15.1.redhat-621084 Service
Implementation SUCCESS [ 15.891 s]
[INFO] JBoss Fuse Tooling :: Core :: Plugins :: Camel 2.15.1.redhat-621117 Service
Implementation SUCCESS [ 14.276 s]
[INFO] JBoss Fuse Tooling :: Core :: Plugins :: Camel 2.17.0.redhat-630187 Service
Implementation SUCCESS [ 23.079 s]
[INFO] JBoss Fuse Tooling :: Core :: Plugins :: Camel 2.17.0.redhat-630224 Service
Implementation SUCCESS [ 31.120 s]
[INFO] JBoss Fuse Tooling :: Core :: Plugins :: Camel 2.17.0.redhat-630254 Service
Implementation SUCCESS [ 24.082 s]
[INFO] JBoss Fuse Tooling :: Core :: Plugins :: Camel 2.17.3 Service Implementation
SUCCESS [ 9.731 s]
[INFO] JBoss Fuse Tooling :: Core :: Plugins :: Camel 2.18.1.redhat-000012 Service
Implementation SUCCESS [ 37.905 s]
[INFO] JBoss Fuse Tooling :: Core :: Plugins :: Camel 2.18.1.redhat-000015 Service
Implementation SUCCESS [ 48.654 s]
[INFO] JBoss Fuse Tooling :: Core :: Plugins :: Maven ..... SUCCESS [ 0.872 s]
[INFO] JBoss Fuse Tooling :: Camel Editor ................. SUCCESS [ 0.012 s]
[INFO] JBoss Fuse Tooling :: Camel Editor :: Plugins ...... SUCCESS [ 0.010 s]
[INFO] JBoss Fuse Tooling :: Camel Editor :: Plugins :: Branding SUCCESS [ 1.432 s]
[INFO] JBoss Fuse Tooling :: Core :: Plugins :: Camel Validation SUCCESS [ 1.047 s]
[INFO] JBoss Fuse Tooling :: Core :: Plugins :: Cheat Sheets SUCCESS [ 0.659 s]
[INFO] JBoss Fuse Tooling :: Core :: Plugins :: Graph ..... SUCCESS [ 0.874 s]
[INFO] JBoss Fuse Tooling :: Core :: Plugins :: Help ...... SUCCESS [ 30.706 s]
[INFO] JBoss Fuse Tooling :: Core :: Plugins :: Imports ... SUCCESS [ 1.019 s]
[INFO] JBoss Fuse Tooling :: Core :: Plugins :: Branding .. SUCCESS [ 0.639 s]
[INFO] JBoss Fuse Tooling :: Core :: Tests ................ SUCCESS [ 0.011 s]
[INFO] JBoss Fuse Tooling :: Core :: Tests :: Camel Service Core Tests SUCCESS [ 2.698
s]
[INFO] JBoss Fuse Tooling :: JMX .......................... SUCCESS [ 0.010 s]
[INFO] JBoss Fuse Tooling :: JMX :: Plugins ............... SUCCESS [ 0.011 s]
[INFO] JBoss Fuse Tooling :: JMX :: Plugins :: JMX Commons SUCCESS [ 1.064 s]
[INFO] JBoss Fuse Tooling :: Camel Editor :: Plugins :: Launcher SUCCESS [ 1.537 s]
[INFO] JBoss Fuse Tooling :: Camel Editor :: Plugins :: Camel Editor SUCCESS [ 2.858 s]
[INFO] JBoss Fuse Tooling :: Core :: Tests :: Camel Service Core Integration Tests SUCCESS
[ 40.340 s]
[INFO] JBoss Fuse Tooling :: Core :: Tests :: Camel Model Tests SUCCESS [ 8.504 s]
[INFO] JBoss Fuse Tooling :: Core :: Tests :: Camel Validation Integration Tests SUCCESS [
0.561 s]
[INFO] JBoss Fuse Tooling :: Core :: Tests :: Camel Validation Tests SUCCESS [ 1.770 s]
[INFO] JBoss Fuse Tooling :: Camel Editor :: Plugins :: Project SUCCESS [ 1.050 s]
[INFO] JBoss Fuse Tooling :: Camel Editor :: Plugins :: Project Templates SUCCESS [ 4.758
s]
[INFO] JBoss Fuse Tooling :: Camel Editor :: Tests ........ SUCCESS [ 0.010 s]
[INFO] JBoss Fuse Tooling :: Camel Editor :: Tests :: Camel Editor Integration Tests
SUCCESS [07:12 min]
[INFO] JBoss Fuse Tooling :: Core :: Tests :: Camel Validation Integration Tests SUCCESS [
15.445 s]
[INFO] JBoss Fuse Tooling :: Core :: Features ............. SUCCESS [ 0.011 s]
[INFO] JBoss Fuse Tooling :: Core :: Features :: Core Feature SUCCESS [ 1.535 s]
[INFO] JBoss Fuse Tooling :: Camel Editor :: Plugins :: XSD Catalogs SUCCESS [ 1.982 s]
[INFO] JBoss Fuse Tooling :: Camel Editor :: Plugins :: Launcher UI SUCCESS [ 1.871 s]
[INFO] JBoss Fuse Tooling :: Camel Editor :: Tests :: Camel Editor Tests SUCCESS [ 3.677
s]
[INFO] JBoss Fuse Tooling :: Camel Editor :: Tests :: Camel IDE Launcher Tests SUCCESS [
1.869 s]
[INFO] JBoss Fuse Tooling :: Camel Editor :: Tests :: Camel IDE Launcher Integration Tests
FAILURE [ 20.373 s]
[INFO] JBoss Fuse Tooling :: Camel Editor :: Tests :: Launcher UI Tests SUCCESS [ 1.980
s]
[INFO] JBoss Fuse Tooling :: Camel Editor :: Tests :: Camel IDE Launcher UI Integration
Tests SUCCESS [ 9.538 s]
[INFO] JBoss Fuse Tooling :: Camel Editor :: Tests :: Camel IDE Project Integration Tests
SUCCESS [ 9.408 s]
[INFO] JBoss Fuse Tooling :: Camel Editor :: Tests :: Project Templates Tests SUCCESS [
1.888 s]
[INFO] JBoss Fuse Tooling :: Camel Editor :: Tests :: Project Templates Integration Tests
FAILURE [24:02 min]
[INFO] JBoss Fuse Tooling :: Camel Editor :: Features ..... SUCCESS [ 0.012 s]
[INFO] JBoss Fuse Tooling :: Camel Editor :: Features :: Camel Editor Feature SUCCESS [
0.904 s]
[INFO] JBoss Fuse Tooling :: Data Transformation .......... SUCCESS [ 0.010 s]
[INFO] JBoss Fuse Tooling :: Data Transformation :: Plugins SUCCESS [ 0.009 s]
[INFO] JBoss Fuse Tooling :: Data Transformation :: Plugins :: Core SUCCESS [ 5.589 s]
[INFO] JBoss Fuse Tooling :: Data Transformation :: Plugins :: Editor SUCCESS [ 4.616 s]
[INFO] JBoss Fuse Tooling :: Data Transformation :: Features SUCCESS [ 0.011 s]
[INFO] JBoss Fuse Tooling :: Data Transformation :: Features :: Data Transformation
Feature SUCCESS [ 0.779 s]
[INFO] JBoss Fuse Tooling :: Core Transformation :: Tests . SUCCESS [ 0.010 s]
[INFO] JBoss Fuse Tooling :: Core Transformation :: Tests :: Core Transformation Tests
SUCCESS [ 2.941 s]
[INFO] JBoss Fuse Tooling :: Core Transformation :: Tests :: Core Transformation
Integration Tests SUCCESS [ 9.320 s]
[INFO] JBoss Fuse Tooling :: Editor Transformation :: Tests :: Editor Transformation Tests
SUCCESS [ 1.777 s]
[INFO] JBoss Fuse Tooling :: Transformation Editor :: Tests :: Transformation Editor
Integration Tests SUCCESS [ 10.424 s]
[INFO] JBoss Fuse Tooling :: JMX :: Plugins :: Apache ActiveMQ Facade SUCCESS [ 21.597 s]
[INFO] JBoss Fuse Tooling :: Server Adapters .............. SUCCESS [ 0.009 s]
[INFO] JBoss Fuse Tooling :: Server Adapters :: Plugins ... SUCCESS [ 0.009 s]
[INFO] JBoss Fuse Tooling :: Server Adapters :: Plugins :: Apache Karaf Adapter Core
SUCCESS [ 1.240 s]
[INFO] JBoss Fuse Tooling :: JMX :: Plugins :: Apache Karaf Facade SUCCESS [ 1.378 s]
[INFO] JBoss Fuse Tooling :: JMX :: Plugins :: Apache Camel Facade SUCCESS [ 1.847 s]
[INFO] JBoss Fuse Tooling :: JMX :: Plugins :: JMX Diagram View SUCCESS [ 1.026 s]
[INFO] JBoss Fuse Tooling :: JMX :: Tests ................. SUCCESS [ 0.009 s]
[INFO] JBoss Fuse Tooling :: JMX :: Tests ::Camel ......... SUCCESS [ 1.863 s]
[INFO] JBoss Fuse Tooling :: JMX :: Integration Tests :: Camel SKIPPED
[INFO] JBoss Fuse Tooling :: JMX :: Tests :: Commons ...... SUCCESS [ 1.663 s]
[INFO] JBoss Fuse Tooling :: JMX :: Tests :: Diagram ::View SUCCESS [ 1.901 s]
[INFO] JBoss Fuse Tooling :: JMX :: Features .............. SUCCESS [ 0.009 s]
[INFO] JBoss Fuse Tooling :: Server Adapters :: Plugins :: Commons SUCCESS [ 0.822 s]
[INFO] JBoss Fuse Tooling :: Server Adapters :: Plugins :: Apache Karaf Adapter UI SUCCESS
[ 1.264 s]
[INFO] JBoss Fuse Tooling :: Server Adapters :: Plugins :: JBoss Fuse Adapter Core SUCCESS
[ 1.007 s]
[INFO] JBoss Fuse Tooling :: Server Adapters :: Plugins :: JBoss Fuse Adapter UI SUCCESS [
0.979 s]
[INFO] JBoss Fuse Tooling :: Server Adapters :: Features .. SUCCESS [ 0.009 s]
[INFO] JBoss Fuse Tooling :: Server Adapters :: Features :: Server Adapters Feature
SUCCESS [ 0.812 s]
[INFO] JBoss Fuse Tooling :: JMX :: Features :: JMX Feature SUCCESS [ 0.984 s]
[INFO] JBoss Fuse Tooling :: Server Adapters :: Tests ..... SUCCESS [ 0.009 s]
[INFO] JBoss Fuse Tooling :: Server Adapters :: Tests :: Karaf Core Tests SUCCESS [ 1.721
s]
[INFO] JBoss Fuse Tooling :: Server Adapters :: Tests :: Server Tests SUCCESS [ 9.211 s]
[INFO] JBoss Fuse Tooling :: Update Site .................. SUCCESS [ 13.868 s]
[INFO] ------------------------------------------------------------------------
[INFO] BUILD FAILURE
[INFO] ------------------------------------------------------------------------
[INFO] Total time: 49:02 min
[INFO] Finished at: 2017-06-02T14:26:59-04:00
[INFO] Final Memory: 333M/1608M
[INFO] ------------------------------------------------------------------------
[ERROR] Failed to execute goal org.eclipse.tycho:tycho-surefire-plugin:1.0.0:test
(default-test) on project org.fusesource.ide.launcher.tests.integration: There are test
failures.
[ERROR]
[ERROR] Please refer to
<
https://fusesource-jenkins.rhev-ci-vms.eng.rdu2.redhat.com/job/Fuse-Tooli...
for the individual test results.
[ERROR] -> [Help 1]
org.apache.maven.lifecycle.LifecycleExecutionException: Failed to execute goal
org.eclipse.tycho:tycho-surefire-plugin:1.0.0:test (default-test) on project
org.fusesource.ide.launcher.tests.integration: There are test failures.
Please refer to
<
https://fusesource-jenkins.rhev-ci-vms.eng.rdu2.redhat.com/job/Fuse-Tooli...
for the individual test results.
at org.apache.maven.lifecycle.internal.MojoExecutor.execute(MojoExecutor.java:212)
at org.apache.maven.lifecycle.internal.MojoExecutor.execute(MojoExecutor.java:153)
at org.apache.maven.lifecycle.internal.MojoExecutor.execute(MojoExecutor.java:145)
at
org.apache.maven.lifecycle.internal.LifecycleModuleBuilder.buildProject(LifecycleModuleBuilder.java:116)
at
org.apache.maven.lifecycle.internal.LifecycleModuleBuilder.buildProject(LifecycleModuleBuilder.java:80)
at
org.apache.maven.lifecycle.internal.builder.singlethreaded.SingleThreadedBuilder.build(SingleThreadedBuilder.java:51)
at
org.apache.maven.lifecycle.internal.LifecycleStarter.execute(LifecycleStarter.java:128)
at org.apache.maven.DefaultMaven.doExecute(DefaultMaven.java:307)
at org.apache.maven.DefaultMaven.doExecute(DefaultMaven.java:193)
at org.apache.maven.DefaultMaven.execute(DefaultMaven.java:106)
at org.apache.maven.cli.MavenCli.execute(MavenCli.java:863)
at org.apache.maven.cli.MavenCli.doMain(MavenCli.java:288)
at org.apache.maven.cli.MavenCli.main(MavenCli.java:199)
at sun.reflect.NativeMethodAccessorImpl.invoke0(Native Method)
at sun.reflect.NativeMethodAccessorImpl.invoke(NativeMethodAccessorImpl.java:62)
at sun.reflect.DelegatingMethodAccessorImpl.invoke(DelegatingMethodAccessorImpl.java:43)
at java.lang.reflect.Method.invoke(Method.java:498)
at org.codehaus.plexus.classworlds.launcher.Launcher.launchEnhanced(Launcher.java:289)
at org.codehaus.plexus.classworlds.launcher.Launcher.launch(Launcher.java:229)
at org.codehaus.plexus.classworlds.launcher.Launcher.mainWithExitCode(Launcher.java:415)
at org.codehaus.plexus.classworlds.launcher.Launcher.main(Launcher.java:356)
Caused by: org.apache.maven.plugin.MojoFailureException: There are test failures.
Please refer to
<
https://fusesource-jenkins.rhev-ci-vms.eng.rdu2.redhat.com/job/Fuse-Tooli...
for the individual test results.
at org.eclipse.tycho.surefire.TestMojo.runTest(TestMojo.java:1002)
at org.eclipse.tycho.surefire.TestMojo.execute(TestMojo.java:667)
at
org.apache.maven.plugin.DefaultBuildPluginManager.executeMojo(DefaultBuildPluginManager.java:134)
at org.apache.maven.lifecycle.internal.MojoExecutor.execute(MojoExecutor.java:207)
... 20 more
[ERROR] Failed to execute goal org.eclipse.tycho:tycho-surefire-plugin:1.0.0:test
(default-test) on project org.fusesource.ide.projecttemplates.tests.integration: There are
test failures.
[ERROR]
[ERROR] Please refer to
<
https://fusesource-jenkins.rhev-ci-vms.eng.rdu2.redhat.com/job/Fuse-Tooli...
for the individual test results.
[ERROR] -> [Help 1]
org.apache.maven.lifecycle.LifecycleExecutionException: Failed to execute goal
org.eclipse.tycho:tycho-surefire-plugin:1.0.0:test (default-test) on project
org.fusesource.ide.projecttemplates.tests.integration: There are test failures.
Please refer to
<
https://fusesource-jenkins.rhev-ci-vms.eng.rdu2.redhat.com/job/Fuse-Tooli...
for the individual test results.
at org.apache.maven.lifecycle.internal.MojoExecutor.execute(MojoExecutor.java:212)
at org.apache.maven.lifecycle.internal.MojoExecutor.execute(MojoExecutor.java:153)
at org.apache.maven.lifecycle.internal.MojoExecutor.execute(MojoExecutor.java:145)
at
org.apache.maven.lifecycle.internal.LifecycleModuleBuilder.buildProject(LifecycleModuleBuilder.java:116)
at
org.apache.maven.lifecycle.internal.LifecycleModuleBuilder.buildProject(LifecycleModuleBuilder.java:80)
at
org.apache.maven.lifecycle.internal.builder.singlethreaded.SingleThreadedBuilder.build(SingleThreadedBuilder.java:51)
at
org.apache.maven.lifecycle.internal.LifecycleStarter.execute(LifecycleStarter.java:128)
at org.apache.maven.DefaultMaven.doExecute(DefaultMaven.java:307)
at org.apache.maven.DefaultMaven.doExecute(DefaultMaven.java:193)
at org.apache.maven.DefaultMaven.execute(DefaultMaven.java:106)
at org.apache.maven.cli.MavenCli.execute(MavenCli.java:863)
at org.apache.maven.cli.MavenCli.doMain(MavenCli.java:288)
at org.apache.maven.cli.MavenCli.main(MavenCli.java:199)
at sun.reflect.NativeMethodAccessorImpl.invoke0(Native Method)
at sun.reflect.NativeMethodAccessorImpl.invoke(NativeMethodAccessorImpl.java:62)
at sun.reflect.DelegatingMethodAccessorImpl.invoke(DelegatingMethodAccessorImpl.java:43)
at java.lang.reflect.Method.invoke(Method.java:498)
at org.codehaus.plexus.classworlds.launcher.Launcher.launchEnhanced(Launcher.java:289)
at org.codehaus.plexus.classworlds.launcher.Launcher.launch(Launcher.java:229)
at org.codehaus.plexus.classworlds.launcher.Launcher.mainWithExitCode(Launcher.java:415)
at org.codehaus.plexus.classworlds.launcher.Launcher.main(Launcher.java:356)
Caused by: org.apache.maven.plugin.MojoFailureException: There are test failures.
Please refer to
<
https://fusesource-jenkins.rhev-ci-vms.eng.rdu2.redhat.com/job/Fuse-Tooli...
for the individual test results.
at org.eclipse.tycho.surefire.TestMojo.runTest(TestMojo.java:1002)
at org.eclipse.tycho.surefire.TestMojo.execute(TestMojo.java:667)
at
org.apache.maven.plugin.DefaultBuildPluginManager.executeMojo(DefaultBuildPluginManager.java:134)
at org.apache.maven.lifecycle.internal.MojoExecutor.execute(MojoExecutor.java:207)
... 20 more
[ERROR]
[ERROR] Re-run Maven using the -X switch to enable full debug logging.
[ERROR]
[ERROR] For more information about the errors and possible solutions, please read the
following articles:
[ERROR] [Help 1]
http://cwiki.apache.org/confluence/display/MAVEN/MojoFailureException
[ERROR]
[ERROR] After correcting the problems, you can resume the build with the command
[ERROR] mvn <goals> -rf :org.fusesource.ide.launcher.tests.integration
Build step 'Invoke top-level Maven targets' marked build as failure
Terminating xvnc.
$ vncserver -kill :84
Killing Xvnc process ID 3421
Archiving artifacts
Recording test results