Build failed in Jenkins: Fuse-Tooling-pullrequest #1048
by Fuse Infra Team
See <https://fusesource-jenkins-rhel7.rhev-ci-vms.eng.rdu2.redhat.com/job/Fuse...>
Changes:
[Aurelien Pupier] FUSETOOLS-2307- Clean code during investigation
[Aurelien Pupier] FUSETOOLS-2307- Provide ability to display breakpoints for routes from
[Aurelien Pupier] FUSETOOLS-1852 - Add basic test for debug capabilities
------------------------------------------
[...truncated 45927 lines...]
testFuseESB[1](org.fusesource.ide.server.tests.locator.FuseESBRuntime6xLocatorIT) Time elapsed: 0.004 sec
Results :
Tests run: 10, Failures: 0, Errors: 0, Skipped: 0
[INFO] All tests passed!
[INFO]
[INFO] --- jacoco-maven-plugin:0.7.9:report (jacoco-site) @ org.fusesource.ide.server.tests ---
[INFO] Skipping JaCoCo execution due to missing execution data file.
[INFO]
[INFO] --- tycho-p2-extras-plugin:0.26.0:compare-version-with-baselines (default) @ org.fusesource.ide.server.tests ---
[INFO]
[INFO] ------------------------------------------------------------------------
[INFO] Building JBoss Fuse Tooling :: Update Site 9.2.0-SNAPSHOT
[INFO] ------------------------------------------------------------------------
[INFO]
[INFO] --- maven-clean-plugin:3.0.0:clean (default-clean) @ org.fusesource.ide.updatesite ---
[INFO]
[INFO] --- tycho-packaging-plugin:0.26.0:build-qualifier-aggregator (default-build-qualifier-aggregator) @ org.fusesource.ide.updatesite ---
[INFO] The project's OSGi version is 9.2.0.v20170328-0906
[INFO]
[INFO] --- build-helper-maven-plugin:1.7:regex-property (regex-property) @ org.fusesource.ide.updatesite ---
[INFO] Setting property 'skipTestsOrITests' to ''.
[INFO]
[INFO] --- maven-enforcer-plugin:1.4.1:enforce (core-has-ui-deps) @ org.fusesource.ide.updatesite ---
[INFO]
[INFO] --- maven-enforcer-plugin:1.4.1:enforce (warn-no-snapshots-AMx) @ org.fusesource.ide.updatesite ---
[ERROR] Found property update.site.version = 9.2.0-SNAPSHOT.LOCAL
[INFO]
[INFO] --- maven-enforcer-plugin:1.4.1:enforce (enforce-no-snapshots-Final) @ org.fusesource.ide.updatesite ---
[ERROR] Found property update.site.version = 9.2.0-SNAPSHOT.LOCAL
[INFO]
[INFO] --- maven-clean-plugin:3.0.0:clean (default-clean-1) @ org.fusesource.ide.updatesite ---
[INFO]
[INFO] --- jacoco-maven-plugin:0.7.9:prepare-agent (default) @ org.fusesource.ide.updatesite ---
[INFO] argLine set to -javaagent:<https://fusesource-jenkins-rhel7.rhev-ci-vms.eng.rdu2.redhat.com/job/Fuse...>
[INFO]
[INFO] --- jacoco-maven-plugin:0.7.9:prepare-agent (agent-for-ut) @ org.fusesource.ide.updatesite ---
[INFO] argLine set to -javaagent:<https://fusesource-jenkins-rhel7.rhev-ci-vms.eng.rdu2.redhat.com/job/Fuse...>:org.jboss.tools.fuse.*
[INFO]
[INFO] --- maven-resources-plugin:2.7:resources (default-resources) @ org.fusesource.ide.updatesite ---
[INFO] Using 'UTF-8' encoding to copy filtered resources.
[INFO] skip non existing resourceDirectory <https://fusesource-jenkins-rhel7.rhev-ci-vms.eng.rdu2.redhat.com/job/Fuse...>
[INFO]
[INFO] --- maven-compiler-plugin:3.5.1:testCompile (compiletests) @ org.fusesource.ide.updatesite ---
[INFO] No sources to compile
[INFO]
[INFO] --- maven-surefire-plugin:2.19.1:test (test) @ org.fusesource.ide.updatesite ---
[INFO] No tests to run.
[INFO]
[INFO] --- tycho-source-plugin:0.26.0:plugin-source (plugin-source) @ org.fusesource.ide.updatesite ---
[INFO]
[INFO] --- target-platform-configuration:0.26.0:target-platform (default-target-platform) @ org.fusesource.ide.updatesite ---
[INFO]
[INFO] --- tycho-p2-publisher-plugin:0.26.0:publish-products (default-publish-products) @ org.fusesource.ide.updatesite ---
[INFO]
[INFO] --- tycho-p2-publisher-plugin:0.26.0:publish-categories (default-publish-categories) @ org.fusesource.ide.updatesite ---
[INFO]
[INFO] --- tycho-p2-publisher-plugin:0.26.0:attach-artifacts (default-attach-artifacts) @ org.fusesource.ide.updatesite ---
[INFO]
[INFO] --- tycho-p2-repository-plugin:0.26.0:assemble-repository (default-assemble-repository) @ org.fusesource.ide.updatesite ---
[INFO]
[INFO] --- tycho-p2-repository-plugin:0.26.0:archive-repository (default-archive-repository) @ org.fusesource.ide.updatesite ---
[INFO] Building zip: <https://fusesource-jenkins-rhel7.rhev-ci-vms.eng.rdu2.redhat.com/job/Fuse...>
[INFO]
[INFO] --- tycho-source-feature-plugin:0.26.0:source-feature (source-feature) @ org.fusesource.ide.updatesite ---
[INFO]
[INFO] --- tycho-p2-plugin:0.26.0:p2-metadata (attached-p2-metadata) @ org.fusesource.ide.updatesite ---
[INFO]
[INFO] --- repository-utils:0.26.0:generate-repository-facade (generate-facade) @ org.fusesource.ide.updatesite ---
[INFO] Building zip: <https://fusesource-jenkins-rhel7.rhev-ci-vms.eng.rdu2.redhat.com/job/Fuse...>
[INFO]
[INFO] --- jacoco-maven-plugin:0.7.9:prepare-agent-integration (agent-for-it) @ org.fusesource.ide.updatesite ---
[INFO] argLine set to -javaagent:<https://fusesource-jenkins-rhel7.rhev-ci-vms.eng.rdu2.redhat.com/job/Fuse...>:org.jboss.tools.fuse.*
[INFO]
[INFO] --- jacoco-maven-plugin:0.7.9:report (jacoco-site) @ org.fusesource.ide.updatesite ---
[INFO] Skipping JaCoCo execution due to missing execution data file.
[INFO]
[INFO] --- tycho-p2-extras-plugin:0.26.0:compare-version-with-baselines (default) @ org.fusesource.ide.updatesite ---
[INFO] ------------------------------------------------------------------------
[INFO] Reactor Summary:
[INFO]
[INFO] JBoss Fuse Tooling :: Build Configuration .......... SUCCESS [ 10.138 s]
[INFO] JBoss Fuse Tooling ................................. SUCCESS [ 23.662 s]
[INFO] JBoss Fuse Tooling :: Tools ........................ SUCCESS [ 0.013 s]
[INFO] JBoss Fuse Tooling :: Tools :: IDE Camel Catalog Generator SUCCESS [01:59 min]
[INFO] JBoss Fuse Tooling :: Core ......................... SUCCESS [ 0.014 s]
[INFO] JBoss Fuse Tooling :: Core :: Plugins .............. SUCCESS [ 0.011 s]
[INFO] JBoss Fuse Tooling :: Core :: Plugins :: Foundation Core SUCCESS [ 11.467 s]
[INFO] JBoss Fuse Tooling :: Core :: Plugins :: Preferences SUCCESS [ 0.199 s]
[INFO] JBoss Fuse Tooling :: Core :: Plugins :: Foundation UI SUCCESS [ 0.851 s]
[INFO] JBoss Fuse Tooling :: Core :: Plugins :: Camel Model Service API SUCCESS [ 9.777 s]
[INFO] JBoss Fuse Tooling :: Core :: Plugins :: Camel 2.15.1.redhat-621084 Service Implementation SUCCESS [ 2.076 s]
[INFO] JBoss Fuse Tooling :: Core :: Plugins :: Camel 2.15.1.redhat-621117 Service Implementation SUCCESS [ 1.929 s]
[INFO] JBoss Fuse Tooling :: Core :: Plugins :: Camel 2.17.0.redhat-630187 Service Implementation SUCCESS [ 18.668 s]
[INFO] JBoss Fuse Tooling :: Core :: Plugins :: Camel 2.17.0.redhat-630224 Service Implementation SUCCESS [ 15.868 s]
[INFO] JBoss Fuse Tooling :: Core :: Plugins :: Camel 2.17.3 Service Implementation SUCCESS [ 4.594 s]
[INFO] JBoss Fuse Tooling :: Core :: Plugins :: Camel 2.18.1.redhat-000012 Service Implementation SUCCESS [ 15.332 s]
[INFO] JBoss Fuse Tooling :: Core :: Plugins :: Maven ..... SUCCESS [ 0.272 s]
[INFO] JBoss Fuse Tooling :: Camel Editor ................. SUCCESS [ 0.009 s]
[INFO] JBoss Fuse Tooling :: Camel Editor :: Plugins ...... SUCCESS [ 0.009 s]
[INFO] JBoss Fuse Tooling :: Camel Editor :: Plugins :: Branding SUCCESS [ 0.535 s]
[INFO] JBoss Fuse Tooling :: Core :: Plugins :: Camel Validation SUCCESS [ 0.350 s]
[INFO] JBoss Fuse Tooling :: Core :: Plugins :: Cheat Sheets SUCCESS [ 0.085 s]
[INFO] JBoss Fuse Tooling :: Core :: Plugins :: Graph ..... SUCCESS [ 0.293 s]
[INFO] JBoss Fuse Tooling :: Core :: Plugins :: Help ...... SUCCESS [ 4.298 s]
[INFO] JBoss Fuse Tooling :: Core :: Plugins :: Imports ... SUCCESS [ 0.287 s]
[INFO] JBoss Fuse Tooling :: Core :: Plugins :: Branding .. SUCCESS [ 0.086 s]
[INFO] JBoss Fuse Tooling :: Core :: Tests ................ SUCCESS [ 0.009 s]
[INFO] JBoss Fuse Tooling :: Core :: Tests :: Camel Service Core Tests SUCCESS [ 3.038 s]
[INFO] JBoss Fuse Tooling :: JMX .......................... SUCCESS [ 0.012 s]
[INFO] JBoss Fuse Tooling :: JMX :: Plugins ............... SUCCESS [ 0.008 s]
[INFO] JBoss Fuse Tooling :: JMX :: Plugins :: JMX Commons SUCCESS [ 0.411 s]
[INFO] JBoss Fuse Tooling :: Camel Editor :: Plugins :: Launcher SUCCESS [ 0.397 s]
[INFO] JBoss Fuse Tooling :: Camel Editor :: Plugins :: Camel Editor SUCCESS [ 1.063 s]
[INFO] JBoss Fuse Tooling :: Core :: Tests :: Camel Service Core Integration Tests SUCCESS [ 39.977 s]
[INFO] JBoss Fuse Tooling :: Core :: Tests :: Camel Model Tests SUCCESS [ 8.289 s]
[INFO] JBoss Fuse Tooling :: Core :: Tests :: Camel Validation Integration Tests FAILURE [ 0.382 s]
[INFO] JBoss Fuse Tooling :: Core :: Tests :: Camel Validation Tests SUCCESS [ 1.787 s]
[INFO] JBoss Fuse Tooling :: Camel Editor :: Plugins :: Project SUCCESS [ 0.412 s]
[INFO] JBoss Fuse Tooling :: Camel Editor :: Plugins :: Project Templates SUCCESS [ 3.094 s]
[INFO] JBoss Fuse Tooling :: Camel Editor :: Tests ........ SUCCESS [ 0.008 s]
[INFO] JBoss Fuse Tooling :: Camel Editor :: Tests :: Camel Editor Integration Tests SKIPPED
[INFO] JBoss Fuse Tooling :: Core :: Tests :: Camel Validation Integration Tests SKIPPED
[INFO] JBoss Fuse Tooling :: Core :: Features ............. SUCCESS [ 0.008 s]
[INFO] JBoss Fuse Tooling :: Core :: Features :: Core Feature SUCCESS [ 0.306 s]
[INFO] JBoss Fuse Tooling :: Camel Editor :: Plugins :: XSD Catalogs SUCCESS [ 0.137 s]
[INFO] JBoss Fuse Tooling :: Camel Editor :: Plugins :: Launcher UI SUCCESS [ 0.362 s]
[INFO] JBoss Fuse Tooling :: Camel Editor :: Tests :: Camel Editor Tests SKIPPED
[INFO] JBoss Fuse Tooling :: Camel Editor :: Tests :: Camel IDE Launcher Tests SUCCESS [ 1.913 s]
[INFO] JBoss Fuse Tooling :: Camel Editor :: Tests :: Launcher UI Tests SUCCESS [ 2.002 s]
[INFO] JBoss Fuse Tooling :: Camel Editor :: Tests :: Camel IDE Launcher UI Integration Tests SUCCESS [ 8.776 s]
[INFO] JBoss Fuse Tooling :: Camel Editor :: Tests :: Camel IDE Project Integration Tests SUCCESS [ 9.372 s]
[INFO] JBoss Fuse Tooling :: Camel Editor :: Tests :: Project Templates Tests SUCCESS [ 2.023 s]
[INFO] JBoss Fuse Tooling :: Camel Editor :: Tests :: Project Templates Integration Tests SKIPPED
[INFO] JBoss Fuse Tooling :: Camel Editor :: Features ..... SUCCESS [ 0.009 s]
[INFO] JBoss Fuse Tooling :: Camel Editor :: Features :: Camel Editor Feature SUCCESS [ 0.228 s]
[INFO] JBoss Fuse Tooling :: Data Transformation .......... SUCCESS [ 0.008 s]
[INFO] JBoss Fuse Tooling :: Data Transformation :: Plugins SUCCESS [ 0.007 s]
[INFO] JBoss Fuse Tooling :: Data Transformation :: Plugins :: Core SUCCESS [ 1.620 s]
[INFO] JBoss Fuse Tooling :: Data Transformation :: Plugins :: Editor SUCCESS [ 0.827 s]
[INFO] JBoss Fuse Tooling :: Data Transformation :: Features SUCCESS [ 0.009 s]
[INFO] JBoss Fuse Tooling :: Data Transformation :: Features :: Data Transformation Feature SUCCESS [ 0.211 s]
[INFO] JBoss Fuse Tooling :: Core Transformation :: Tests . SUCCESS [ 0.008 s]
[INFO] JBoss Fuse Tooling :: Core Transformation :: Tests :: Core Transformation Tests SUCCESS [ 2.705 s]
[INFO] JBoss Fuse Tooling :: Core Transformation :: Tests :: Core Transformation Integration Tests SUCCESS [ 9.416 s]
[INFO] JBoss Fuse Tooling :: Editor Transformation :: Tests :: Editor Transformation Tests SUCCESS [ 1.619 s]
[INFO] JBoss Fuse Tooling :: Transformation Editor :: Tests :: Transformation Editor Integration Tests SUCCESS [ 10.076 s]
[INFO] JBoss Fuse Tooling :: JMX :: Plugins :: Apache ActiveMQ Facade SUCCESS [ 7.471 s]
[INFO] JBoss Fuse Tooling :: JMX :: Plugins :: Apache Camel Facade SUCCESS [ 0.438 s]
[INFO] JBoss Fuse Tooling :: JMX :: Plugins :: JMX Diagram View SUCCESS [ 0.354 s]
[INFO] JBoss Fuse Tooling :: Server Adapters .............. SUCCESS [ 0.008 s]
[INFO] JBoss Fuse Tooling :: Server Adapters :: Plugins ... SUCCESS [ 0.007 s]
[INFO] JBoss Fuse Tooling :: Server Adapters :: Plugins :: Apache Karaf Adapter Core SUCCESS [ 0.429 s]
[INFO] JBoss Fuse Tooling :: JMX :: Plugins :: Apache Karaf Facade SUCCESS [ 0.438 s]
[INFO] JBoss Fuse Tooling :: JMX :: Tests ................. SUCCESS [ 0.009 s]
[INFO] JBoss Fuse Tooling :: JMX :: Tests ::Camel ......... SUCCESS [ 1.543 s]
[INFO] JBoss Fuse Tooling :: JMX :: Integration Tests :: Camel SUCCESS [ 7.040 s]
[INFO] JBoss Fuse Tooling :: JMX :: Tests :: Commons ...... SUCCESS [ 1.651 s]
[INFO] JBoss Fuse Tooling :: JMX :: Tests :: Diagram ::View SUCCESS [ 1.823 s]
[INFO] JBoss Fuse Tooling :: JMX :: Features .............. SUCCESS [ 0.009 s]
[INFO] JBoss Fuse Tooling :: Server Adapters :: Plugins :: Commons SUCCESS [ 0.254 s]
[INFO] JBoss Fuse Tooling :: Server Adapters :: Plugins :: Apache Karaf Adapter UI SUCCESS [ 0.559 s]
[INFO] JBoss Fuse Tooling :: Server Adapters :: Plugins :: JBoss Fuse Adapter Core SUCCESS [ 0.322 s]
[INFO] JBoss Fuse Tooling :: Server Adapters :: Plugins :: JBoss Fuse Adapter UI SUCCESS [ 0.348 s]
[INFO] JBoss Fuse Tooling :: Server Adapters :: Features .. SUCCESS [ 0.008 s]
[INFO] JBoss Fuse Tooling :: Server Adapters :: Features :: Server Adapters Feature SUCCESS [ 0.205 s]
[INFO] JBoss Fuse Tooling :: JMX :: Features :: JMX Feature SUCCESS [ 0.248 s]
[INFO] JBoss Fuse Tooling :: Server Adapters :: Tests ..... SUCCESS [ 0.008 s]
[INFO] JBoss Fuse Tooling :: Server Adapters :: Tests :: Karaf Core Tests SUCCESS [ 1.655 s]
[INFO] JBoss Fuse Tooling :: Server Adapters :: Tests :: Server Tests SUCCESS [ 9.581 s]
[INFO] JBoss Fuse Tooling :: Update Site .................. SUCCESS [ 9.565 s]
[INFO] ------------------------------------------------------------------------
[INFO] BUILD FAILURE
[INFO] ------------------------------------------------------------------------
[INFO] Total time: 14:02 min
[INFO] Finished at: 2017-03-28T05:21:25-04:00
[INFO] Final Memory: 375M/1610M
[INFO] ------------------------------------------------------------------------
[ERROR] Failed to execute goal org.eclipse.tycho:tycho-compiler-plugin:0.26.0:compile (default-compile) on project org.fusesource.ide.camel.tests.util: Compilation failure: Compilation failure:
[ERROR] <https://fusesource-jenkins-rhel7.rhev-ci-vms.eng.rdu2.redhat.com/job/Fuse...>:[25]
[ERROR] import org.apache.maven.model.Model;
[ERROR] ^^^^^^^^^^^^^^^^^^^^^^^^^^^^
[ERROR] Access restriction: The type 'Model' is not API (restriction on classpath entry '<https://fusesource-jenkins-rhel7.rhev-ci-vms.eng.rdu2.redhat.com/job/Fuse...')>
[ERROR] <https://fusesource-jenkins-rhel7.rhev-ci-vms.eng.rdu2.redhat.com/job/Fuse...>:[61]
[ERROR] Model model = mavenModelManager.readMavenModel(pomFile);
[ERROR] ^^^^^
[ERROR] Access restriction: The type 'Model' is not API (restriction on classpath entry '<https://fusesource-jenkins-rhel7.rhev-ci-vms.eng.rdu2.redhat.com/job/Fuse...')>
[ERROR] <https://fusesource-jenkins-rhel7.rhev-ci-vms.eng.rdu2.redhat.com/job/Fuse...>:[86]
[ERROR] Model model = projectInfos.get(0).getModel();
[ERROR] ^^^^^
[ERROR] Access restriction: The type 'Model' is not API (restriction on classpath entry '<https://fusesource-jenkins-rhel7.rhev-ci-vms.eng.rdu2.redhat.com/job/Fuse...')>
[ERROR] <https://fusesource-jenkins-rhel7.rhev-ci-vms.eng.rdu2.redhat.com/job/Fuse...>:[89]
[ERROR] fail("Project " + model.getGroupId() + "-" + model.getArtifactId() + "-" + model.getVersion()
[ERROR] ^^^^^^^^^^^^^^^^^^
[ERROR] Access restriction: The method 'Model.getGroupId()' is not API (restriction on classpath entry '<https://fusesource-jenkins-rhel7.rhev-ci-vms.eng.rdu2.redhat.com/job/Fuse...')>
[ERROR] <https://fusesource-jenkins-rhel7.rhev-ci-vms.eng.rdu2.redhat.com/job/Fuse...>:[89]
[ERROR] fail("Project " + model.getGroupId() + "-" + model.getArtifactId() + "-" + model.getVersion()
[ERROR] ^^^^^^^^^^^^^^^^^^^^^
[ERROR] Access restriction: The method 'Model.getArtifactId()' is not API (restriction on classpath entry '<https://fusesource-jenkins-rhel7.rhev-ci-vms.eng.rdu2.redhat.com/job/Fuse...')>
[ERROR] <https://fusesource-jenkins-rhel7.rhev-ci-vms.eng.rdu2.redhat.com/job/Fuse...>:[89]
[ERROR] fail("Project " + model.getGroupId() + "-" + model.getArtifactId() + "-" + model.getVersion()
[ERROR] ^^^^^^^^^^^^^^^^^^
[ERROR] Access restriction: The method 'Model.getVersion()' is not API (restriction on classpath entry '<https://fusesource-jenkins-rhel7.rhev-ci-vms.eng.rdu2.redhat.com/job/Fuse...')>
[ERROR] 6 problems (6 errors)
[ERROR] -> [Help 1]
org.apache.maven.lifecycle.LifecycleExecutionException: Failed to execute goal org.eclipse.tycho:tycho-compiler-plugin:0.26.0:compile (default-compile) on project org.fusesource.ide.camel.tests.util: Compilation failure
at org.apache.maven.lifecycle.internal.MojoExecutor.execute(MojoExecutor.java:212)
at org.apache.maven.lifecycle.internal.MojoExecutor.execute(MojoExecutor.java:153)
at org.apache.maven.lifecycle.internal.MojoExecutor.execute(MojoExecutor.java:145)
at org.apache.maven.lifecycle.internal.LifecycleModuleBuilder.buildProject(LifecycleModuleBuilder.java:116)
at org.apache.maven.lifecycle.internal.LifecycleModuleBuilder.buildProject(LifecycleModuleBuilder.java:80)
at org.apache.maven.lifecycle.internal.builder.singlethreaded.SingleThreadedBuilder.build(SingleThreadedBuilder.java:51)
at org.apache.maven.lifecycle.internal.LifecycleStarter.execute(LifecycleStarter.java:128)
at org.apache.maven.DefaultMaven.doExecute(DefaultMaven.java:307)
at org.apache.maven.DefaultMaven.doExecute(DefaultMaven.java:193)
at org.apache.maven.DefaultMaven.execute(DefaultMaven.java:106)
at org.apache.maven.cli.MavenCli.execute(MavenCli.java:863)
at org.apache.maven.cli.MavenCli.doMain(MavenCli.java:288)
at org.apache.maven.cli.MavenCli.main(MavenCli.java:199)
at sun.reflect.NativeMethodAccessorImpl.invoke0(Native Method)
at sun.reflect.NativeMethodAccessorImpl.invoke(NativeMethodAccessorImpl.java:62)
at sun.reflect.DelegatingMethodAccessorImpl.invoke(DelegatingMethodAccessorImpl.java:43)
at java.lang.reflect.Method.invoke(Method.java:498)
at org.codehaus.plexus.classworlds.launcher.Launcher.launchEnhanced(Launcher.java:289)
at org.codehaus.plexus.classworlds.launcher.Launcher.launch(Launcher.java:229)
at org.codehaus.plexus.classworlds.launcher.Launcher.mainWithExitCode(Launcher.java:415)
at org.codehaus.plexus.classworlds.launcher.Launcher.main(Launcher.java:356)
Caused by: copied.org.apache.maven.plugin.CompilationFailureException: Compilation failure
at copied.org.apache.maven.plugin.AbstractCompilerMojo.execute(AbstractCompilerMojo.java:420)
at org.eclipse.tycho.compiler.AbstractOsgiCompilerMojo.execute(AbstractOsgiCompilerMojo.java:293)
at org.apache.maven.plugin.DefaultBuildPluginManager.executeMojo(DefaultBuildPluginManager.java:134)
at org.apache.maven.lifecycle.internal.MojoExecutor.execute(MojoExecutor.java:207)
... 20 more
[ERROR]
[ERROR] Re-run Maven using the -X switch to enable full debug logging.
[ERROR]
[ERROR] For more information about the errors and possible solutions, please read the following articles:
[ERROR] [Help 1] http://cwiki.apache.org/confluence/display/MAVEN/MojoFailureException
[ERROR]
[ERROR] After correcting the problems, you can resume the build with the command
[ERROR] mvn <goals> -rf :org.fusesource.ide.camel.tests.util
Build step 'Invoke top-level Maven targets' marked build as failure
Terminating xvnc.
$ vncserver -kill :83
Killing Xvnc process ID 15274
Archiving artifacts
Recording test results
7 years, 11 months
Build failed in Jenkins: Fuse-Tooling-9.2.x-Update-Site #93
by Fuse Infra Team
See <https://fusesource-jenkins-rhel7.rhev-ci-vms.eng.rdu2.redhat.com/job/Fuse...>
Changes:
[Aurelien Pupier] Constructors should not be used for String
------------------------------------------
[...truncated 13231 lines...]
[INFO] tycho.testArgLine set to -javaagent:<https://fusesource-jenkins-rhel7.rhev-ci-vms.eng.rdu2.redhat.com/job/Fuse...>:org.jboss.tools.fuse.*
[INFO]
[INFO] --- tycho-surefire-plugin:0.26.0:test (default-test) @ org.fusesource.ide.server.tests ---
[INFO] Expected eclipse log file: <https://fusesource-jenkins-rhel7.rhev-ci-vms.eng.rdu2.redhat.com/job/Fuse...> sp(a)xn--c/-bja.metadata/.log
[INFO] Command line:
[/usr/lib/jvm/java-1.8.0-openjdk-1.8.0.121-0.b13.el7_3.x86_64/jre/bin/java, -Dosgi.noShutdown=false, -Dosgi.os=linux, -Dosgi.ws=gtk, -Dosgi.arch=x86_64, -javaagent:<https://fusesource-jenkins-rhel7.rhev-ci-vms.eng.rdu2.redhat.com/job/Fuse...>:org.jboss.tools.fuse.*, -XX:+HeapDumpOnOutOfMemoryError, -Dusage_reporting_enabled=false, -Dorg.jboss.tools.vpe.loadxulrunner=false, -Dosgi.clean=true, -jar, <https://fusesource-jenkins-rhel7.rhev-ci-vms.eng.rdu2.redhat.com/job/Fuse...,> -data, <https://fusesource-jenkins-rhel7.rhev-ci-vms.eng.rdu2.redhat.com/job/Fuse...> sp@cé, -install, <https://fusesource-jenkins-rhel7.rhev-ci-vms.eng.rdu2.redhat.com/job/Fuse...,> -configuration, <https://fusesource-jenkins-rhel7.rhev-ci-vms.eng.rdu2.redhat.com/job/Fuse...,> -application, org.eclipse.tycho.surefire.osgibooter.uitest, -testproperties, <https://fusesource-jenkins-rhel7.rhev-ci-vms.eng.rdu2.redhat.com/job/Fuse...]>
-------------------------------------------------------
T E S T S
-------------------------------------------------------
Running org.fusesource.ide.server.tests.bean.FuseESBServerBean6xIT
Tests run: 2, Failures: 0, Errors: 0, Skipped: 0, Time elapsed: 0.064 sec - in org.fusesource.ide.server.tests.bean.FuseESBServerBean6xIT
testFuseESB[0](org.fusesource.ide.server.tests.bean.FuseESBServerBean6xIT) Time elapsed: 0.027 sec
testFuseESB[1](org.fusesource.ide.server.tests.bean.FuseESBServerBean6xIT) Time elapsed: 0.001 sec
Running org.fusesource.ide.server.tests.bean.KarafServerBean3xIT
Tests run: 1, Failures: 0, Errors: 0, Skipped: 0, Time elapsed: 0.009 sec - in org.fusesource.ide.server.tests.bean.KarafServerBean3xIT
testKaraf[0](org.fusesource.ide.server.tests.bean.KarafServerBean3xIT) Time elapsed: 0.004 sec
Running org.fusesource.ide.server.tests.bean.KarafServerBean2xIT
Tests run: 2, Failures: 0, Errors: 0, Skipped: 0, Time elapsed: 0.004 sec - in org.fusesource.ide.server.tests.bean.KarafServerBean2xIT
testKaraf[0](org.fusesource.ide.server.tests.bean.KarafServerBean2xIT) Time elapsed: 0.001 sec
testKaraf[1](org.fusesource.ide.server.tests.bean.KarafServerBean2xIT) Time elapsed: 0.001 sec
Running org.fusesource.ide.server.tests.locator.KarafRuntime2xLocatorIT
Tests run: 2, Failures: 0, Errors: 0, Skipped: 0, Time elapsed: 0.032 sec - in org.fusesource.ide.server.tests.locator.KarafRuntime2xLocatorIT
testKaraf[0](org.fusesource.ide.server.tests.locator.KarafRuntime2xLocatorIT) Time elapsed: 0.024 sec
testKaraf[1](org.fusesource.ide.server.tests.locator.KarafRuntime2xLocatorIT) Time elapsed: 0.005 sec
Running org.fusesource.ide.server.tests.locator.FuseESBRuntime6xLocatorIT
Tests run: 2, Failures: 0, Errors: 0, Skipped: 0, Time elapsed: 0.013 sec - in org.fusesource.ide.server.tests.locator.FuseESBRuntime6xLocatorIT
testFuseESB[0](org.fusesource.ide.server.tests.locator.FuseESBRuntime6xLocatorIT) Time elapsed: 0.008 sec
testFuseESB[1](org.fusesource.ide.server.tests.locator.FuseESBRuntime6xLocatorIT) Time elapsed: 0.004 sec
Running org.fusesource.ide.server.tests.locator.KarafRuntime3xLocatorIT
Tests run: 1, Failures: 0, Errors: 0, Skipped: 0, Time elapsed: 0.009 sec - in org.fusesource.ide.server.tests.locator.KarafRuntime3xLocatorIT
testKaraf[0](org.fusesource.ide.server.tests.locator.KarafRuntime3xLocatorIT) Time elapsed: 0.008 sec
Results :
Tests run: 10, Failures: 0, Errors: 0, Skipped: 0
[INFO] All tests passed!
[INFO]
[INFO] --- jacoco-maven-plugin:0.7.9:report (jacoco-site) @ org.fusesource.ide.server.tests ---
[INFO] Skipping JaCoCo execution due to missing execution data file.
[INFO]
[INFO] --- tycho-p2-extras-plugin:0.26.0:compare-version-with-baselines (default) @ org.fusesource.ide.server.tests ---
[INFO]
[INFO] --- maven-install-plugin:2.3.1:install (default-install) @ org.fusesource.ide.server.tests ---
[INFO] Installing <https://fusesource-jenkins-rhel7.rhev-ci-vms.eng.rdu2.redhat.com/job/Fuse...> to <https://fusesource-jenkins-rhel7.rhev-ci-vms.eng.rdu2.redhat.com/job/Fuse...>
[INFO] Installing <https://fusesource-jenkins-rhel7.rhev-ci-vms.eng.rdu2.redhat.com/job/Fuse...> to <https://fusesource-jenkins-rhel7.rhev-ci-vms.eng.rdu2.redhat.com/job/Fuse...>
[INFO] Installing <https://fusesource-jenkins-rhel7.rhev-ci-vms.eng.rdu2.redhat.com/job/Fuse...> to <https://fusesource-jenkins-rhel7.rhev-ci-vms.eng.rdu2.redhat.com/job/Fuse...>
[INFO] Installing <https://fusesource-jenkins-rhel7.rhev-ci-vms.eng.rdu2.redhat.com/job/Fuse...> to <https://fusesource-jenkins-rhel7.rhev-ci-vms.eng.rdu2.redhat.com/job/Fuse...>
[INFO] Installing <https://fusesource-jenkins-rhel7.rhev-ci-vms.eng.rdu2.redhat.com/job/Fuse...> to <https://fusesource-jenkins-rhel7.rhev-ci-vms.eng.rdu2.redhat.com/job/Fuse...>
[INFO] Installing <https://fusesource-jenkins-rhel7.rhev-ci-vms.eng.rdu2.redhat.com/job/Fuse...> to <https://fusesource-jenkins-rhel7.rhev-ci-vms.eng.rdu2.redhat.com/job/Fuse...>
[INFO] Installing <https://fusesource-jenkins-rhel7.rhev-ci-vms.eng.rdu2.redhat.com/job/Fuse...> to <https://fusesource-jenkins-rhel7.rhev-ci-vms.eng.rdu2.redhat.com/job/Fuse...>
[INFO]
[INFO] --- tycho-p2-plugin:0.26.0:update-local-index (default-update-local-index) @ org.fusesource.ide.server.tests ---
[INFO]
[INFO] ------------------------------------------------------------------------
[INFO] Building JBoss Fuse Tooling :: Update Site 9.2.0-SNAPSHOT
[INFO] ------------------------------------------------------------------------
[INFO]
[INFO] --- maven-clean-plugin:3.0.0:clean (default-clean) @ org.fusesource.ide.updatesite ---
[INFO]
[INFO] --- tycho-packaging-plugin:0.26.0:build-qualifier-aggregator (default-build-qualifier-aggregator) @ org.fusesource.ide.updatesite ---
[INFO] The project's OSGi version is 9.2.0.CI-v20170327-0935-B93
[INFO]
[INFO] --- build-helper-maven-plugin:1.7:regex-property (regex-property) @ org.fusesource.ide.updatesite ---
[INFO] Setting property 'skipTestsOrITests' to ''.
[INFO]
[INFO] --- maven-enforcer-plugin:1.4.1:enforce (core-has-ui-deps) @ org.fusesource.ide.updatesite ---
[INFO]
[INFO] --- maven-enforcer-plugin:1.4.1:enforce (warn-no-snapshots-AMx) @ org.fusesource.ide.updatesite ---
[ERROR] Found property update.site.version = 9.2.0-SNAPSHOT.CI
[INFO]
[INFO] --- maven-enforcer-plugin:1.4.1:enforce (enforce-no-snapshots-Final) @ org.fusesource.ide.updatesite ---
[ERROR] Found property update.site.version = 9.2.0-SNAPSHOT.CI
[INFO]
[INFO] --- maven-clean-plugin:3.0.0:clean (default-clean-1) @ org.fusesource.ide.updatesite ---
[INFO]
[INFO] --- jacoco-maven-plugin:0.7.9:prepare-agent (default) @ org.fusesource.ide.updatesite ---
[INFO] argLine set to -javaagent:<https://fusesource-jenkins-rhel7.rhev-ci-vms.eng.rdu2.redhat.com/job/Fuse...>
[INFO]
[INFO] --- jacoco-maven-plugin:0.7.9:prepare-agent (agent-for-ut) @ org.fusesource.ide.updatesite ---
[INFO] argLine set to -javaagent:<https://fusesource-jenkins-rhel7.rhev-ci-vms.eng.rdu2.redhat.com/job/Fuse...>:org.jboss.tools.fuse.*
[INFO]
[INFO] --- maven-resources-plugin:2.7:resources (default-resources) @ org.fusesource.ide.updatesite ---
[INFO] Using 'UTF-8' encoding to copy filtered resources.
[INFO] skip non existing resourceDirectory <https://fusesource-jenkins-rhel7.rhev-ci-vms.eng.rdu2.redhat.com/job/Fuse...>
[INFO]
[INFO] --- maven-compiler-plugin:3.5.1:testCompile (compiletests) @ org.fusesource.ide.updatesite ---
[INFO] No sources to compile
[INFO]
[INFO] --- maven-surefire-plugin:2.19.1:test (test) @ org.fusesource.ide.updatesite ---
[INFO] No tests to run.
[INFO]
[INFO] --- tycho-source-plugin:0.26.0:plugin-source (plugin-source) @ org.fusesource.ide.updatesite ---
[INFO]
[INFO] --- target-platform-configuration:0.26.0:target-platform (default-target-platform) @ org.fusesource.ide.updatesite ---
[INFO]
[INFO] --- tycho-p2-publisher-plugin:0.26.0:publish-products (default-publish-products) @ org.fusesource.ide.updatesite ---
[INFO]
[INFO] --- tycho-p2-publisher-plugin:0.26.0:publish-categories (default-publish-categories) @ org.fusesource.ide.updatesite ---
[INFO]
[INFO] --- tycho-p2-publisher-plugin:0.26.0:attach-artifacts (default-attach-artifacts) @ org.fusesource.ide.updatesite ---
[INFO]
[INFO] --- tycho-p2-repository-plugin:0.26.0:assemble-repository (default-assemble-repository) @ org.fusesource.ide.updatesite ---
[INFO]
[INFO] --- tycho-p2-repository-plugin:0.26.0:archive-repository (default-archive-repository) @ org.fusesource.ide.updatesite ---
[INFO] Building zip: <https://fusesource-jenkins-rhel7.rhev-ci-vms.eng.rdu2.redhat.com/job/Fuse...>
[INFO]
[INFO] --- tycho-source-feature-plugin:0.26.0:source-feature (source-feature) @ org.fusesource.ide.updatesite ---
[INFO]
[INFO] --- tycho-p2-plugin:0.26.0:p2-metadata (attached-p2-metadata) @ org.fusesource.ide.updatesite ---
[INFO]
[INFO] --- repository-utils:0.26.0:generate-repository-facade (generate-facade) @ org.fusesource.ide.updatesite ---
[INFO] Building zip: <https://fusesource-jenkins-rhel7.rhev-ci-vms.eng.rdu2.redhat.com/job/Fuse...>
[INFO]
[INFO] --- jacoco-maven-plugin:0.7.9:prepare-agent-integration (agent-for-it) @ org.fusesource.ide.updatesite ---
[INFO] argLine set to -javaagent:<https://fusesource-jenkins-rhel7.rhev-ci-vms.eng.rdu2.redhat.com/job/Fuse...>:org.jboss.tools.fuse.*
[INFO]
[INFO] --- jacoco-maven-plugin:0.7.9:report (jacoco-site) @ org.fusesource.ide.updatesite ---
[INFO] Skipping JaCoCo execution due to missing execution data file.
[INFO]
[INFO] --- tycho-p2-extras-plugin:0.26.0:compare-version-with-baselines (default) @ org.fusesource.ide.updatesite ---
[INFO]
[INFO] --- maven-install-plugin:2.3.1:install (default-install) @ org.fusesource.ide.updatesite ---
[INFO] Installing <https://fusesource-jenkins-rhel7.rhev-ci-vms.eng.rdu2.redhat.com/job/Fuse...> to <https://fusesource-jenkins-rhel7.rhev-ci-vms.eng.rdu2.redhat.com/job/Fuse...>
[INFO] Installing <https://fusesource-jenkins-rhel7.rhev-ci-vms.eng.rdu2.redhat.com/job/Fuse...> to <https://fusesource-jenkins-rhel7.rhev-ci-vms.eng.rdu2.redhat.com/job/Fuse...>
[INFO] Installing <https://fusesource-jenkins-rhel7.rhev-ci-vms.eng.rdu2.redhat.com/job/Fuse...> to <https://fusesource-jenkins-rhel7.rhev-ci-vms.eng.rdu2.redhat.com/job/Fuse...>
[INFO] Installing <https://fusesource-jenkins-rhel7.rhev-ci-vms.eng.rdu2.redhat.com/job/Fuse...> to <https://fusesource-jenkins-rhel7.rhev-ci-vms.eng.rdu2.redhat.com/job/Fuse...>
[INFO]
[INFO] --- tycho-p2-plugin:0.26.0:update-local-index (default-update-local-index) @ org.fusesource.ide.updatesite ---
[INFO] ------------------------------------------------------------------------
[INFO] Reactor Summary:
[INFO]
[INFO] JBoss Fuse Tooling :: Build Configuration .......... SUCCESS [ 10.548 s]
[INFO] JBoss Fuse Tooling ................................. SUCCESS [ 21.908 s]
[INFO] JBoss Fuse Tooling :: Tools ........................ SUCCESS [ 0.014 s]
[INFO] JBoss Fuse Tooling :: Tools :: IDE Camel Catalog Generator SUCCESS [01:45 min]
[INFO] JBoss Fuse Tooling :: Core ......................... SUCCESS [ 0.016 s]
[INFO] JBoss Fuse Tooling :: Core :: Plugins .............. SUCCESS [ 0.017 s]
[INFO] JBoss Fuse Tooling :: Core :: Plugins :: Foundation Core SUCCESS [ 16.531 s]
[INFO] JBoss Fuse Tooling :: Core :: Plugins :: Preferences SUCCESS [ 0.203 s]
[INFO] JBoss Fuse Tooling :: Core :: Plugins :: Foundation UI SUCCESS [ 0.873 s]
[INFO] JBoss Fuse Tooling :: Core :: Plugins :: Camel Model Service API SUCCESS [ 8.540 s]
[INFO] JBoss Fuse Tooling :: Core :: Plugins :: Camel 2.15.1.redhat-621084 Service Implementation SUCCESS [ 2.301 s]
[INFO] JBoss Fuse Tooling :: Core :: Plugins :: Camel 2.15.1.redhat-621117 Service Implementation SUCCESS [ 1.873 s]
[INFO] JBoss Fuse Tooling :: Core :: Plugins :: Camel 2.17.0.redhat-630187 Service Implementation SUCCESS [ 21.556 s]
[INFO] JBoss Fuse Tooling :: Core :: Plugins :: Camel 2.17.0.redhat-630224 Service Implementation SUCCESS [ 18.608 s]
[INFO] JBoss Fuse Tooling :: Core :: Plugins :: Camel 2.17.3 Service Implementation SUCCESS [ 4.588 s]
[INFO] JBoss Fuse Tooling :: Core :: Plugins :: Camel 2.18.1.redhat-000012 Service Implementation SUCCESS [ 14.832 s]
[INFO] JBoss Fuse Tooling :: Core :: Plugins :: Maven ..... SUCCESS [ 0.275 s]
[INFO] JBoss Fuse Tooling :: Camel Editor ................. SUCCESS [ 0.011 s]
[INFO] JBoss Fuse Tooling :: Camel Editor :: Plugins ...... SUCCESS [ 0.011 s]
[INFO] JBoss Fuse Tooling :: Camel Editor :: Plugins :: Branding SUCCESS [ 0.532 s]
[INFO] JBoss Fuse Tooling :: Core :: Plugins :: Camel Validation SUCCESS [ 0.378 s]
[INFO] JBoss Fuse Tooling :: Core :: Plugins :: Cheat Sheets SUCCESS [ 0.094 s]
[INFO] JBoss Fuse Tooling :: Core :: Plugins :: Graph ..... SUCCESS [ 0.310 s]
[INFO] JBoss Fuse Tooling :: Core :: Plugins :: Help ...... SUCCESS [ 4.301 s]
[INFO] JBoss Fuse Tooling :: Core :: Plugins :: Imports ... SUCCESS [ 0.286 s]
[INFO] JBoss Fuse Tooling :: Core :: Plugins :: Branding .. SUCCESS [ 0.091 s]
[INFO] JBoss Fuse Tooling :: Core :: Tests ................ SUCCESS [ 0.010 s]
[INFO] JBoss Fuse Tooling :: Core :: Tests :: Camel Service Core Tests SUCCESS [ 3.092 s]
[INFO] JBoss Fuse Tooling :: JMX .......................... SUCCESS [ 0.011 s]
[INFO] JBoss Fuse Tooling :: JMX :: Plugins ............... SUCCESS [ 0.009 s]
[INFO] JBoss Fuse Tooling :: JMX :: Plugins :: JMX Commons SUCCESS [ 0.390 s]
[INFO] JBoss Fuse Tooling :: Camel Editor :: Plugins :: Launcher SUCCESS [ 0.423 s]
[INFO] JBoss Fuse Tooling :: Camel Editor :: Plugins :: Camel Editor SUCCESS [ 0.980 s]
[INFO] JBoss Fuse Tooling :: Core :: Tests :: Camel Service Core Integration Tests SUCCESS [ 37.508 s]
[INFO] JBoss Fuse Tooling :: Core :: Tests :: Camel Model Tests SUCCESS [ 8.181 s]
[INFO] JBoss Fuse Tooling :: Core :: Tests :: Camel Validation Integration Tests SUCCESS [ 0.532 s]
[INFO] JBoss Fuse Tooling :: Core :: Tests :: Camel Validation Tests SUCCESS [ 1.664 s]
[INFO] JBoss Fuse Tooling :: Camel Editor :: Plugins :: Project SUCCESS [ 0.490 s]
[INFO] JBoss Fuse Tooling :: Camel Editor :: Plugins :: Project Templates SUCCESS [ 3.420 s]
[INFO] JBoss Fuse Tooling :: Camel Editor :: Tests ........ SUCCESS [ 0.011 s]
[INFO] JBoss Fuse Tooling :: Camel Editor :: Tests :: Camel Editor Integration Tests SUCCESS [05:39 min]
[INFO] JBoss Fuse Tooling :: Core :: Tests :: Camel Validation Integration Tests SUCCESS [ 15.836 s]
[INFO] JBoss Fuse Tooling :: Core :: Features ............. SUCCESS [ 0.015 s]
[INFO] JBoss Fuse Tooling :: Core :: Features :: Core Feature SUCCESS [ 0.285 s]
[INFO] JBoss Fuse Tooling :: Camel Editor :: Plugins :: XSD Catalogs SUCCESS [ 0.147 s]
[INFO] JBoss Fuse Tooling :: Camel Editor :: Plugins :: Launcher UI SUCCESS [ 0.369 s]
[INFO] JBoss Fuse Tooling :: Camel Editor :: Tests :: Camel Editor Tests SUCCESS [ 3.712 s]
[INFO] JBoss Fuse Tooling :: Camel Editor :: Tests :: Camel IDE Launcher Tests SUCCESS [ 1.884 s]
[INFO] JBoss Fuse Tooling :: Camel Editor :: Tests :: Launcher UI Tests SUCCESS [ 2.042 s]
[INFO] JBoss Fuse Tooling :: Camel Editor :: Tests :: Camel IDE Launcher UI Integration Tests SUCCESS [ 8.626 s]
[INFO] JBoss Fuse Tooling :: Camel Editor :: Tests :: Camel IDE Project Integration Tests SUCCESS [ 9.410 s]
[INFO] JBoss Fuse Tooling :: Camel Editor :: Tests :: Project Templates Tests SUCCESS [ 1.934 s]
[INFO] JBoss Fuse Tooling :: Camel Editor :: Tests :: Project Templates Integration Tests FAILURE [18:24 min]
[INFO] JBoss Fuse Tooling :: Camel Editor :: Features ..... SUCCESS [ 0.012 s]
[INFO] JBoss Fuse Tooling :: Camel Editor :: Features :: Camel Editor Feature SUCCESS [ 0.226 s]
[INFO] JBoss Fuse Tooling :: Data Transformation .......... SUCCESS [ 0.009 s]
[INFO] JBoss Fuse Tooling :: Data Transformation :: Plugins SUCCESS [ 0.008 s]
[INFO] JBoss Fuse Tooling :: Data Transformation :: Plugins :: Core SUCCESS [ 2.077 s]
[INFO] JBoss Fuse Tooling :: Data Transformation :: Plugins :: Editor SUCCESS [ 0.822 s]
[INFO] JBoss Fuse Tooling :: Data Transformation :: Features SUCCESS [ 0.011 s]
[INFO] JBoss Fuse Tooling :: Data Transformation :: Features :: Data Transformation Feature SUCCESS [ 0.220 s]
[INFO] JBoss Fuse Tooling :: Core Transformation :: Tests . SUCCESS [ 0.009 s]
[INFO] JBoss Fuse Tooling :: Core Transformation :: Tests :: Core Transformation Tests SUCCESS [ 2.684 s]
[INFO] JBoss Fuse Tooling :: Core Transformation :: Tests :: Core Transformation Integration Tests SUCCESS [ 9.694 s]
[INFO] JBoss Fuse Tooling :: Editor Transformation :: Tests :: Editor Transformation Tests SUCCESS [ 1.689 s]
[INFO] JBoss Fuse Tooling :: Transformation Editor :: Tests :: Transformation Editor Integration Tests SUCCESS [ 10.491 s]
[INFO] JBoss Fuse Tooling :: JMX :: Plugins :: Apache ActiveMQ Facade SUCCESS [ 6.412 s]
[INFO] JBoss Fuse Tooling :: JMX :: Plugins :: Apache Camel Facade SUCCESS [ 0.435 s]
[INFO] JBoss Fuse Tooling :: JMX :: Plugins :: JMX Diagram View SUCCESS [ 0.371 s]
[INFO] JBoss Fuse Tooling :: Server Adapters .............. SUCCESS [ 0.010 s]
[INFO] JBoss Fuse Tooling :: Server Adapters :: Plugins ... SUCCESS [ 0.008 s]
[INFO] JBoss Fuse Tooling :: Server Adapters :: Plugins :: Apache Karaf Adapter Core SUCCESS [ 0.447 s]
[INFO] JBoss Fuse Tooling :: JMX :: Plugins :: Apache Karaf Facade SUCCESS [ 0.411 s]
[INFO] JBoss Fuse Tooling :: JMX :: Tests ................. SUCCESS [ 0.010 s]
[INFO] JBoss Fuse Tooling :: JMX :: Tests ::Camel ......... SUCCESS [ 1.517 s]
[INFO] JBoss Fuse Tooling :: JMX :: Integration Tests :: Camel SUCCESS [ 7.722 s]
[INFO] JBoss Fuse Tooling :: JMX :: Tests :: Commons ...... SUCCESS [ 1.688 s]
[INFO] JBoss Fuse Tooling :: JMX :: Tests :: Diagram ::View SUCCESS [ 2.508 s]
[INFO] JBoss Fuse Tooling :: JMX :: Features .............. SUCCESS [ 0.010 s]
[INFO] JBoss Fuse Tooling :: Server Adapters :: Plugins :: Commons SUCCESS [ 0.268 s]
[INFO] JBoss Fuse Tooling :: Server Adapters :: Plugins :: Apache Karaf Adapter UI SUCCESS [ 0.436 s]
[INFO] JBoss Fuse Tooling :: Server Adapters :: Plugins :: JBoss Fuse Adapter Core SUCCESS [ 0.328 s]
[INFO] JBoss Fuse Tooling :: Server Adapters :: Plugins :: JBoss Fuse Adapter UI SUCCESS [ 0.373 s]
[INFO] JBoss Fuse Tooling :: Server Adapters :: Features .. SUCCESS [ 0.010 s]
[INFO] JBoss Fuse Tooling :: Server Adapters :: Features :: Server Adapters Feature SUCCESS [ 0.208 s]
[INFO] JBoss Fuse Tooling :: JMX :: Features :: JMX Feature SUCCESS [ 0.237 s]
[INFO] JBoss Fuse Tooling :: Server Adapters :: Tests ..... SUCCESS [ 0.021 s]
[INFO] JBoss Fuse Tooling :: Server Adapters :: Tests :: Karaf Core Tests SUCCESS [ 1.732 s]
[INFO] JBoss Fuse Tooling :: Server Adapters :: Tests :: Server Tests SUCCESS [ 9.851 s]
[INFO] JBoss Fuse Tooling :: Update Site .................. SUCCESS [ 9.916 s]
[INFO] ------------------------------------------------------------------------
[INFO] BUILD FAILURE
[INFO] ------------------------------------------------------------------------
[INFO] Total time: 38:32 min
[INFO] Finished at: 2017-03-27T06:19:50-04:00
[INFO] Final Memory: 315M/827M
[INFO] ------------------------------------------------------------------------
[ERROR] Failed to execute goal org.eclipse.tycho:tycho-surefire-plugin:0.26.0:test (default-test) on project org.fusesource.ide.projecttemplates.tests.integration: There are test failures.
[ERROR]
[ERROR] Please refer to <https://fusesource-jenkins-rhel7.rhev-ci-vms.eng.rdu2.redhat.com/job/Fuse...> for the individual test results.
[ERROR] -> [Help 1]
[ERROR]
[ERROR] To see the full stack trace of the errors, re-run Maven with the -e switch.
[ERROR] Re-run Maven using the -X switch to enable full debug logging.
[ERROR]
[ERROR] For more information about the errors and possible solutions, please read the following articles:
[ERROR] [Help 1] http://cwiki.apache.org/confluence/display/MAVEN/MojoFailureException
[ERROR]
[ERROR] After correcting the problems, you can resume the build with the command
[ERROR] mvn <goals> -rf :org.fusesource.ide.projecttemplates.tests.integration
Build step 'Invoke top-level Maven targets' marked build as failure
Terminating xvnc.
$ vncserver -kill :96
Killing Xvnc process ID 11610
Archiving artifacts
Recording test results
7 years, 11 months
Build failed in Jenkins: Fuse-Tooling-pullrequest #1042
by Fuse Infra Team
See <https://fusesource-jenkins-rhel7.rhev-ci-vms.eng.rdu2.redhat.com/job/Fuse...>
Changes:
[john.verhaeg] FUSETOOLS-2342: Fix issues in NewTransformationWizard found by SonarQube
------------------------------------------
[...truncated 47389 lines...]
[INFO] --- maven-enforcer-plugin:1.4.1:enforce (enforce-no-snapshots-Final) @ org.fusesource.ide.server.tests ---
[INFO]
[INFO] --- jacoco-maven-plugin:0.7.9:prepare-agent (default) @ org.fusesource.ide.server.tests ---
[INFO] tycho.testArgLine set to -javaagent:<https://fusesource-jenkins-rhel7.rhev-ci-vms.eng.rdu2.redhat.com/job/Fuse...>
[INFO]
[INFO] --- jacoco-maven-plugin:0.7.9:prepare-agent (agent-for-ut) @ org.fusesource.ide.server.tests ---
[INFO] tycho.testArgLine set to -javaagent:<https://fusesource-jenkins-rhel7.rhev-ci-vms.eng.rdu2.redhat.com/job/Fuse...>:org.jboss.tools.fuse.*
[INFO]
[INFO] --- maven-resources-plugin:2.7:resources (default-resources) @ org.fusesource.ide.server.tests ---
[INFO] Using 'UTF-8' encoding to copy filtered resources.
[INFO] skip non existing resourceDirectory <https://fusesource-jenkins-rhel7.rhev-ci-vms.eng.rdu2.redhat.com/job/Fuse...>
[INFO]
[INFO] --- tycho-compiler-plugin:0.26.0:compile (default-compile) @ org.fusesource.ide.server.tests ---
[INFO] Compiling 12 source files to <https://fusesource-jenkins-rhel7.rhev-ci-vms.eng.rdu2.redhat.com/job/Fuse...>
[INFO]
[INFO] --- maven-resources-plugin:2.7:testResources (default-testResources) @ org.fusesource.ide.server.tests ---
[INFO] Using 'UTF-8' encoding to copy filtered resources.
[INFO] skip non existing resourceDirectory <https://fusesource-jenkins-rhel7.rhev-ci-vms.eng.rdu2.redhat.com/job/Fuse...>
[INFO]
[INFO] --- maven-compiler-plugin:3.5.1:testCompile (compiletests) @ org.fusesource.ide.server.tests ---
[INFO] No sources to compile
[INFO]
[INFO] --- maven-surefire-plugin:2.19.1:test (test) @ org.fusesource.ide.server.tests ---
[INFO] No tests to run.
[INFO]
[INFO] --- tycho-source-plugin:0.26.0:plugin-source (plugin-source) @ org.fusesource.ide.server.tests ---
[INFO] Building jar: <https://fusesource-jenkins-rhel7.rhev-ci-vms.eng.rdu2.redhat.com/job/Fuse...>
[INFO]
[INFO] --- target-platform-configuration:0.26.0:target-platform (default-target-platform) @ org.fusesource.ide.server.tests ---
[INFO]
[INFO] --- tycho-packaging-plugin:0.26.0:package-plugin (default-package-plugin) @ org.fusesource.ide.server.tests ---
[INFO] Building jar: <https://fusesource-jenkins-rhel7.rhev-ci-vms.eng.rdu2.redhat.com/job/Fuse...>
[INFO]
[INFO] --- tycho-p2-plugin:0.26.0:p2-metadata-default (default-p2-metadata-default) @ org.fusesource.ide.server.tests ---
[INFO] No baseline version MavenProject: org.fusesource.ide.servers:org.fusesource.ide.server.tests:9.2.0-SNAPSHOT @ <https://fusesource-jenkins-rhel7.rhev-ci-vms.eng.rdu2.redhat.com/job/Fuse...>
[INFO]
[INFO] --- tycho-source-feature-plugin:0.26.0:source-feature (source-feature) @ org.fusesource.ide.server.tests ---
[INFO]
[INFO] --- tycho-p2-plugin:0.26.0:p2-metadata (attached-p2-metadata) @ org.fusesource.ide.server.tests ---
[INFO] No baseline version MavenProject: org.fusesource.ide.servers:org.fusesource.ide.server.tests:9.2.0-SNAPSHOT @ <https://fusesource-jenkins-rhel7.rhev-ci-vms.eng.rdu2.redhat.com/job/Fuse...>
[INFO]
[INFO] --- repository-utils:0.26.1:generate-repository-facade (generate-facade) @ org.fusesource.ide.server.tests ---
[INFO]
[INFO] --- jacoco-maven-plugin:0.7.9:prepare-agent-integration (agent-for-it) @ org.fusesource.ide.server.tests ---
[INFO] tycho.testArgLine set to -javaagent:<https://fusesource-jenkins-rhel7.rhev-ci-vms.eng.rdu2.redhat.com/job/Fuse...>:org.jboss.tools.fuse.*
[INFO]
[INFO] --- tycho-surefire-plugin:0.26.0:test (default-test) @ org.fusesource.ide.server.tests ---
[INFO] Expected eclipse log file: <https://fusesource-jenkins-rhel7.rhev-ci-vms.eng.rdu2.redhat.com/job/Fuse...> sp(a)xn--c/-bja.metadata/.log
[INFO] Command line:
[/usr/lib/jvm/java-1.8.0-openjdk-1.8.0.121-0.b13.el7_3.x86_64/jre/bin/java, -Dosgi.noShutdown=false, -Dosgi.os=linux, -Dosgi.ws=gtk, -Dosgi.arch=x86_64, -javaagent:<https://fusesource-jenkins-rhel7.rhev-ci-vms.eng.rdu2.redhat.com/job/Fuse...>:org.jboss.tools.fuse.*, -XX:+HeapDumpOnOutOfMemoryError, -Dusage_reporting_enabled=false, -Dorg.jboss.tools.vpe.loadxulrunner=false, -Dosgi.clean=true, -jar, <https://fusesource-jenkins-rhel7.rhev-ci-vms.eng.rdu2.redhat.com/job/Fuse...,> -data, <https://fusesource-jenkins-rhel7.rhev-ci-vms.eng.rdu2.redhat.com/job/Fuse...> sp@cé, -install, <https://fusesource-jenkins-rhel7.rhev-ci-vms.eng.rdu2.redhat.com/job/Fuse...,> -configuration, <https://fusesource-jenkins-rhel7.rhev-ci-vms.eng.rdu2.redhat.com/job/Fuse...,> -application, org.eclipse.tycho.surefire.osgibooter.uitest, -testproperties, <https://fusesource-jenkins-rhel7.rhev-ci-vms.eng.rdu2.redhat.com/job/Fuse...]>
-------------------------------------------------------
T E S T S
-------------------------------------------------------
Running org.fusesource.ide.server.tests.bean.KarafServerBean3xIT
Tests run: 1, Failures: 0, Errors: 0, Skipped: 0, Time elapsed: 0.071 sec - in org.fusesource.ide.server.tests.bean.KarafServerBean3xIT
testKaraf[0](org.fusesource.ide.server.tests.bean.KarafServerBean3xIT) Time elapsed: 0.028 sec
Running org.fusesource.ide.server.tests.bean.FuseESBServerBean6xIT
Tests run: 2, Failures: 0, Errors: 0, Skipped: 0, Time elapsed: 0.007 sec - in org.fusesource.ide.server.tests.bean.FuseESBServerBean6xIT
testFuseESB[0](org.fusesource.ide.server.tests.bean.FuseESBServerBean6xIT) Time elapsed: 0.002 sec
testFuseESB[1](org.fusesource.ide.server.tests.bean.FuseESBServerBean6xIT) Time elapsed: 0.001 sec
Running org.fusesource.ide.server.tests.bean.KarafServerBean2xIT
Tests run: 2, Failures: 0, Errors: 0, Skipped: 0, Time elapsed: 0.004 sec - in org.fusesource.ide.server.tests.bean.KarafServerBean2xIT
testKaraf[0](org.fusesource.ide.server.tests.bean.KarafServerBean2xIT) Time elapsed: 0.002 sec
testKaraf[1](org.fusesource.ide.server.tests.bean.KarafServerBean2xIT) Time elapsed: 0 sec
Running org.fusesource.ide.server.tests.locator.KarafRuntime2xLocatorIT
Tests run: 2, Failures: 0, Errors: 0, Skipped: 0, Time elapsed: 0.029 sec - in org.fusesource.ide.server.tests.locator.KarafRuntime2xLocatorIT
testKaraf[0](org.fusesource.ide.server.tests.locator.KarafRuntime2xLocatorIT) Time elapsed: 0.022 sec
testKaraf[1](org.fusesource.ide.server.tests.locator.KarafRuntime2xLocatorIT) Time elapsed: 0.005 sec
Running org.fusesource.ide.server.tests.locator.KarafRuntime3xLocatorIT
Tests run: 1, Failures: 0, Errors: 0, Skipped: 0, Time elapsed: 0.01 sec - in org.fusesource.ide.server.tests.locator.KarafRuntime3xLocatorIT
testKaraf[0](org.fusesource.ide.server.tests.locator.KarafRuntime3xLocatorIT) Time elapsed: 0.008 sec
Running org.fusesource.ide.server.tests.locator.FuseESBRuntime6xLocatorIT
Tests run: 2, Failures: 0, Errors: 0, Skipped: 0, Time elapsed: 0.012 sec - in org.fusesource.ide.server.tests.locator.FuseESBRuntime6xLocatorIT
testFuseESB[0](org.fusesource.ide.server.tests.locator.FuseESBRuntime6xLocatorIT) Time elapsed: 0.007 sec
testFuseESB[1](org.fusesource.ide.server.tests.locator.FuseESBRuntime6xLocatorIT) Time elapsed: 0.003 sec
Results :
Tests run: 10, Failures: 0, Errors: 0, Skipped: 0
[INFO] All tests passed!
[INFO]
[INFO] --- jacoco-maven-plugin:0.7.9:report (jacoco-site) @ org.fusesource.ide.server.tests ---
[INFO] Skipping JaCoCo execution due to missing execution data file.
[INFO]
[INFO] --- tycho-p2-extras-plugin:0.26.0:compare-version-with-baselines (default) @ org.fusesource.ide.server.tests ---
[INFO]
[INFO] ------------------------------------------------------------------------
[INFO] Skipping JBoss Fuse Tooling :: Update Site
[INFO] This project has been banned from the build due to previous failures.
[INFO] ------------------------------------------------------------------------
[INFO] ------------------------------------------------------------------------
[INFO] Reactor Summary:
[INFO]
[INFO] JBoss Fuse Tooling :: Build Configuration .......... SUCCESS [ 9.735 s]
[INFO] JBoss Fuse Tooling ................................. SUCCESS [ 24.608 s]
[INFO] JBoss Fuse Tooling :: Tools ........................ SUCCESS [ 0.012 s]
[INFO] JBoss Fuse Tooling :: Tools :: IDE Camel Catalog Generator SUCCESS [02:01 min]
[INFO] JBoss Fuse Tooling :: Core ......................... SUCCESS [ 0.012 s]
[INFO] JBoss Fuse Tooling :: Core :: Plugins .............. SUCCESS [ 0.011 s]
[INFO] JBoss Fuse Tooling :: Core :: Plugins :: Foundation Core SUCCESS [ 9.887 s]
[INFO] JBoss Fuse Tooling :: Core :: Plugins :: Preferences SUCCESS [ 0.203 s]
[INFO] JBoss Fuse Tooling :: Core :: Plugins :: Foundation UI SUCCESS [ 0.849 s]
[INFO] JBoss Fuse Tooling :: Core :: Plugins :: Camel Model Service API SUCCESS [ 9.087 s]
[INFO] JBoss Fuse Tooling :: Core :: Plugins :: Camel 2.15.1.redhat-621084 Service Implementation SUCCESS [ 2.322 s]
[INFO] JBoss Fuse Tooling :: Core :: Plugins :: Camel 2.15.1.redhat-621117 Service Implementation SUCCESS [ 1.679 s]
[INFO] JBoss Fuse Tooling :: Core :: Plugins :: Camel 2.17.0.redhat-630187 Service Implementation SUCCESS [ 19.321 s]
[INFO] JBoss Fuse Tooling :: Core :: Plugins :: Camel 2.17.0.redhat-630224 Service Implementation SUCCESS [ 18.240 s]
[INFO] JBoss Fuse Tooling :: Core :: Plugins :: Camel 2.17.3 Service Implementation SUCCESS [ 4.532 s]
[INFO] JBoss Fuse Tooling :: Core :: Plugins :: Camel 2.18.1.redhat-000012 Service Implementation SUCCESS [ 16.408 s]
[INFO] JBoss Fuse Tooling :: Core :: Plugins :: Maven ..... SUCCESS [ 0.267 s]
[INFO] JBoss Fuse Tooling :: Camel Editor ................. SUCCESS [ 0.009 s]
[INFO] JBoss Fuse Tooling :: Camel Editor :: Plugins ...... SUCCESS [ 0.009 s]
[INFO] JBoss Fuse Tooling :: Camel Editor :: Plugins :: Branding SUCCESS [ 0.506 s]
[INFO] JBoss Fuse Tooling :: Core :: Plugins :: Camel Validation SUCCESS [ 0.391 s]
[INFO] JBoss Fuse Tooling :: Core :: Plugins :: Cheat Sheets SUCCESS [ 0.091 s]
[INFO] JBoss Fuse Tooling :: Core :: Plugins :: Graph ..... SUCCESS [ 0.293 s]
[INFO] JBoss Fuse Tooling :: Core :: Plugins :: Help ...... SUCCESS [ 4.299 s]
[INFO] JBoss Fuse Tooling :: Core :: Plugins :: Imports ... SUCCESS [ 0.268 s]
[INFO] JBoss Fuse Tooling :: Core :: Plugins :: Branding .. SUCCESS [ 0.088 s]
[INFO] JBoss Fuse Tooling :: Core :: Tests ................ SUCCESS [ 0.009 s]
[INFO] JBoss Fuse Tooling :: Core :: Tests :: Camel Service Core Tests SUCCESS [ 3.234 s]
[INFO] JBoss Fuse Tooling :: JMX .......................... SUCCESS [ 0.012 s]
[INFO] JBoss Fuse Tooling :: JMX :: Plugins ............... SUCCESS [ 0.009 s]
[INFO] JBoss Fuse Tooling :: JMX :: Plugins :: JMX Commons SUCCESS [ 0.391 s]
[INFO] JBoss Fuse Tooling :: Camel Editor :: Plugins :: Launcher SUCCESS [ 0.409 s]
[INFO] JBoss Fuse Tooling :: Camel Editor :: Plugins :: Camel Editor SUCCESS [ 1.000 s]
[INFO] JBoss Fuse Tooling :: Core :: Tests :: Camel Service Core Integration Tests SUCCESS [ 37.766 s]
[INFO] JBoss Fuse Tooling :: Core :: Tests :: Camel Model Tests SUCCESS [ 8.238 s]
[INFO] JBoss Fuse Tooling :: Core :: Tests :: Camel Validation Integration Tests SUCCESS [ 0.536 s]
[INFO] JBoss Fuse Tooling :: Core :: Tests :: Camel Validation Tests SUCCESS [ 1.798 s]
[INFO] JBoss Fuse Tooling :: Camel Editor :: Plugins :: Project SUCCESS [ 0.422 s]
[INFO] JBoss Fuse Tooling :: Camel Editor :: Plugins :: Project Templates SUCCESS [ 3.192 s]
[INFO] JBoss Fuse Tooling :: Camel Editor :: Tests ........ SUCCESS [ 0.011 s]
[INFO] JBoss Fuse Tooling :: Camel Editor :: Tests :: Camel Editor Integration Tests SUCCESS [05:37 min]
[INFO] JBoss Fuse Tooling :: Core :: Tests :: Camel Validation Integration Tests SUCCESS [ 15.833 s]
[INFO] JBoss Fuse Tooling :: Core :: Features ............. SUCCESS [ 0.008 s]
[INFO] JBoss Fuse Tooling :: Core :: Features :: Core Feature SUCCESS [ 0.297 s]
[INFO] JBoss Fuse Tooling :: Camel Editor :: Plugins :: XSD Catalogs SUCCESS [ 0.140 s]
[INFO] JBoss Fuse Tooling :: Camel Editor :: Plugins :: Launcher UI SUCCESS [ 0.390 s]
[INFO] JBoss Fuse Tooling :: Camel Editor :: Tests :: Camel Editor Tests SUCCESS [ 3.717 s]
[INFO] JBoss Fuse Tooling :: Camel Editor :: Tests :: Camel IDE Launcher Tests SUCCESS [ 1.873 s]
[INFO] JBoss Fuse Tooling :: Camel Editor :: Tests :: Launcher UI Tests SUCCESS [ 1.951 s]
[INFO] JBoss Fuse Tooling :: Camel Editor :: Tests :: Camel IDE Launcher UI Integration Tests SUCCESS [ 8.912 s]
[INFO] JBoss Fuse Tooling :: Camel Editor :: Tests :: Camel IDE Project Integration Tests SUCCESS [ 9.628 s]
[INFO] JBoss Fuse Tooling :: Camel Editor :: Tests :: Project Templates Tests SUCCESS [ 1.815 s]
[INFO] JBoss Fuse Tooling :: Camel Editor :: Tests :: Project Templates Integration Tests SUCCESS [18:48 min]
[INFO] JBoss Fuse Tooling :: Camel Editor :: Features ..... SUCCESS [ 0.009 s]
[INFO] JBoss Fuse Tooling :: Camel Editor :: Features :: Camel Editor Feature SUCCESS [ 0.237 s]
[INFO] JBoss Fuse Tooling :: Data Transformation .......... SUCCESS [ 0.007 s]
[INFO] JBoss Fuse Tooling :: Data Transformation :: Plugins SUCCESS [ 0.007 s]
[INFO] JBoss Fuse Tooling :: Data Transformation :: Plugins :: Core SUCCESS [ 2.293 s]
[INFO] JBoss Fuse Tooling :: Data Transformation :: Plugins :: Editor FAILURE [ 0.671 s]
[INFO] JBoss Fuse Tooling :: Data Transformation :: Features SUCCESS [ 0.008 s]
[INFO] JBoss Fuse Tooling :: Data Transformation :: Features :: Data Transformation Feature SKIPPED
[INFO] JBoss Fuse Tooling :: Core Transformation :: Tests . SUCCESS [ 0.007 s]
[INFO] JBoss Fuse Tooling :: Core Transformation :: Tests :: Core Transformation Tests SUCCESS [ 2.615 s]
[INFO] JBoss Fuse Tooling :: Core Transformation :: Tests :: Core Transformation Integration Tests SUCCESS [ 9.403 s]
[INFO] JBoss Fuse Tooling :: Editor Transformation :: Tests :: Editor Transformation Tests SKIPPED
[INFO] JBoss Fuse Tooling :: Transformation Editor :: Tests :: Transformation Editor Integration Tests SKIPPED
[INFO] JBoss Fuse Tooling :: JMX :: Plugins :: Apache ActiveMQ Facade SUCCESS [ 7.704 s]
[INFO] JBoss Fuse Tooling :: JMX :: Plugins :: Apache Camel Facade SUCCESS [ 0.522 s]
[INFO] JBoss Fuse Tooling :: JMX :: Plugins :: JMX Diagram View SUCCESS [ 0.356 s]
[INFO] JBoss Fuse Tooling :: Server Adapters .............. SUCCESS [ 0.007 s]
[INFO] JBoss Fuse Tooling :: Server Adapters :: Plugins ... SUCCESS [ 0.007 s]
[INFO] JBoss Fuse Tooling :: Server Adapters :: Plugins :: Apache Karaf Adapter Core SUCCESS [ 0.441 s]
[INFO] JBoss Fuse Tooling :: JMX :: Plugins :: Apache Karaf Facade SUCCESS [ 0.448 s]
[INFO] JBoss Fuse Tooling :: JMX :: Tests ................. SUCCESS [ 0.009 s]
[INFO] JBoss Fuse Tooling :: JMX :: Tests ::Camel ......... SUCCESS [ 1.535 s]
[INFO] JBoss Fuse Tooling :: JMX :: Integration Tests :: Camel SUCCESS [ 7.366 s]
[INFO] JBoss Fuse Tooling :: JMX :: Tests :: Commons ...... SUCCESS [ 1.686 s]
[INFO] JBoss Fuse Tooling :: JMX :: Tests :: Diagram ::View SUCCESS [ 1.844 s]
[INFO] JBoss Fuse Tooling :: JMX :: Features .............. SUCCESS [ 0.007 s]
[INFO] JBoss Fuse Tooling :: Server Adapters :: Plugins :: Commons SUCCESS [ 0.386 s]
[INFO] JBoss Fuse Tooling :: Server Adapters :: Plugins :: Apache Karaf Adapter UI SUCCESS [ 0.464 s]
[INFO] JBoss Fuse Tooling :: Server Adapters :: Plugins :: JBoss Fuse Adapter Core SUCCESS [ 0.330 s]
[INFO] JBoss Fuse Tooling :: Server Adapters :: Plugins :: JBoss Fuse Adapter UI SUCCESS [ 0.364 s]
[INFO] JBoss Fuse Tooling :: Server Adapters :: Features .. SUCCESS [ 0.007 s]
[INFO] JBoss Fuse Tooling :: Server Adapters :: Features :: Server Adapters Feature SUCCESS [ 0.222 s]
[INFO] JBoss Fuse Tooling :: JMX :: Features :: JMX Feature SUCCESS [ 0.276 s]
[INFO] JBoss Fuse Tooling :: Server Adapters :: Tests ..... SUCCESS [ 0.008 s]
[INFO] JBoss Fuse Tooling :: Server Adapters :: Tests :: Karaf Core Tests SUCCESS [ 1.671 s]
[INFO] JBoss Fuse Tooling :: Server Adapters :: Tests :: Server Tests SUCCESS [ 9.598 s]
[INFO] JBoss Fuse Tooling :: Update Site .................. SKIPPED
[INFO] ------------------------------------------------------------------------
[INFO] BUILD FAILURE
[INFO] ------------------------------------------------------------------------
[INFO] Total time: 40:09 min
[INFO] Finished at: 2017-03-27T02:13:34-04:00
[INFO] Final Memory: 419M/1472M
[INFO] ------------------------------------------------------------------------
[ERROR] Failed to execute goal org.eclipse.tycho:tycho-compiler-plugin:0.26.0:compile (default-compile) on project org.jboss.tools.fuse.transformation.editor: Compilation failure: Compilation failure:
[ERROR] <https://fusesource-jenkins-rhel7.rhev-ci-vms.eng.rdu2.redhat.com/job/Fuse...>:[76]
[ERROR] import javafx.scene.shape.Path;
[ERROR] ^^^^^^
[ERROR] The import javafx cannot be resolved
[ERROR] <https://fusesource-jenkins-rhel7.rhev-ci-vms.eng.rdu2.redhat.com/job/Fuse...>:[323]
[ERROR] Platform.getContentTypeManager().getContentType(DozerConfigContentTypeDescriber.ID))[0];
[ERROR] ^^^^^^^^
[ERROR] Platform cannot be resolved
[ERROR] <https://fusesource-jenkins-rhel7.rhev-ci-vms.eng.rdu2.redhat.com/job/Fuse...>:[431]
[ERROR] while (CamelUtils.project().exists(new Path(javaSourceFolder + pkgName))) {
[ERROR] ^^^^
[ERROR] Path cannot be resolved to a type
[ERROR] 3 problems (3 errors)
[ERROR] -> [Help 1]
org.apache.maven.lifecycle.LifecycleExecutionException: Failed to execute goal org.eclipse.tycho:tycho-compiler-plugin:0.26.0:compile (default-compile) on project org.jboss.tools.fuse.transformation.editor: Compilation failure
at org.apache.maven.lifecycle.internal.MojoExecutor.execute(MojoExecutor.java:212)
at org.apache.maven.lifecycle.internal.MojoExecutor.execute(MojoExecutor.java:153)
at org.apache.maven.lifecycle.internal.MojoExecutor.execute(MojoExecutor.java:145)
at org.apache.maven.lifecycle.internal.LifecycleModuleBuilder.buildProject(LifecycleModuleBuilder.java:116)
at org.apache.maven.lifecycle.internal.LifecycleModuleBuilder.buildProject(LifecycleModuleBuilder.java:80)
at org.apache.maven.lifecycle.internal.builder.singlethreaded.SingleThreadedBuilder.build(SingleThreadedBuilder.java:51)
at org.apache.maven.lifecycle.internal.LifecycleStarter.execute(LifecycleStarter.java:128)
at org.apache.maven.DefaultMaven.doExecute(DefaultMaven.java:307)
at org.apache.maven.DefaultMaven.doExecute(DefaultMaven.java:193)
at org.apache.maven.DefaultMaven.execute(DefaultMaven.java:106)
at org.apache.maven.cli.MavenCli.execute(MavenCli.java:863)
at org.apache.maven.cli.MavenCli.doMain(MavenCli.java:288)
at org.apache.maven.cli.MavenCli.main(MavenCli.java:199)
at sun.reflect.NativeMethodAccessorImpl.invoke0(Native Method)
at sun.reflect.NativeMethodAccessorImpl.invoke(NativeMethodAccessorImpl.java:62)
at sun.reflect.DelegatingMethodAccessorImpl.invoke(DelegatingMethodAccessorImpl.java:43)
at java.lang.reflect.Method.invoke(Method.java:498)
at org.codehaus.plexus.classworlds.launcher.Launcher.launchEnhanced(Launcher.java:289)
at org.codehaus.plexus.classworlds.launcher.Launcher.launch(Launcher.java:229)
at org.codehaus.plexus.classworlds.launcher.Launcher.mainWithExitCode(Launcher.java:415)
at org.codehaus.plexus.classworlds.launcher.Launcher.main(Launcher.java:356)
Caused by: copied.org.apache.maven.plugin.CompilationFailureException: Compilation failure
at copied.org.apache.maven.plugin.AbstractCompilerMojo.execute(AbstractCompilerMojo.java:420)
at org.eclipse.tycho.compiler.AbstractOsgiCompilerMojo.execute(AbstractOsgiCompilerMojo.java:293)
at org.apache.maven.plugin.DefaultBuildPluginManager.executeMojo(DefaultBuildPluginManager.java:134)
at org.apache.maven.lifecycle.internal.MojoExecutor.execute(MojoExecutor.java:207)
... 20 more
[ERROR]
[ERROR] Re-run Maven using the -X switch to enable full debug logging.
[ERROR]
[ERROR] For more information about the errors and possible solutions, please read the following articles:
[ERROR] [Help 1] http://cwiki.apache.org/confluence/display/MAVEN/MojoFailureException
[ERROR]
[ERROR] After correcting the problems, you can resume the build with the command
[ERROR] mvn <goals> -rf :org.jboss.tools.fuse.transformation.editor
Build step 'Invoke top-level Maven targets' marked build as failure
Terminating xvnc.
$ vncserver -kill :91
Killing Xvnc process ID 3712
Archiving artifacts
Recording test results
7 years, 11 months
Build failed in Jenkins: Fuse-Tooling-9.2.x-Update-Site #91
by Fuse Infra Team
See <https://fusesource-jenkins-rhel7.rhev-ci-vms.eng.rdu2.redhat.com/job/Fuse...>
Changes:
[Aurelien Pupier] Use optimized Char functions to improve performance
------------------------------------------
[...truncated 13363 lines...]
[INFO] tycho.testArgLine set to -javaagent:<https://fusesource-jenkins-rhel7.rhev-ci-vms.eng.rdu2.redhat.com/job/Fuse...>:org.jboss.tools.fuse.*
[INFO]
[INFO] --- tycho-surefire-plugin:0.26.0:test (default-test) @ org.fusesource.ide.server.tests ---
[INFO] Expected eclipse log file: <https://fusesource-jenkins-rhel7.rhev-ci-vms.eng.rdu2.redhat.com/job/Fuse...> sp(a)xn--c/-bja.metadata/.log
[INFO] Command line:
[/usr/lib/jvm/java-1.8.0-openjdk-1.8.0.121-0.b13.el7_3.x86_64/jre/bin/java, -Dosgi.noShutdown=false, -Dosgi.os=linux, -Dosgi.ws=gtk, -Dosgi.arch=x86_64, -javaagent:<https://fusesource-jenkins-rhel7.rhev-ci-vms.eng.rdu2.redhat.com/job/Fuse...>:org.jboss.tools.fuse.*, -XX:+HeapDumpOnOutOfMemoryError, -Dusage_reporting_enabled=false, -Dorg.jboss.tools.vpe.loadxulrunner=false, -Dosgi.clean=true, -jar, <https://fusesource-jenkins-rhel7.rhev-ci-vms.eng.rdu2.redhat.com/job/Fuse...,> -data, <https://fusesource-jenkins-rhel7.rhev-ci-vms.eng.rdu2.redhat.com/job/Fuse...> sp@cé, -install, <https://fusesource-jenkins-rhel7.rhev-ci-vms.eng.rdu2.redhat.com/job/Fuse...,> -configuration, <https://fusesource-jenkins-rhel7.rhev-ci-vms.eng.rdu2.redhat.com/job/Fuse...,> -application, org.eclipse.tycho.surefire.osgibooter.uitest, -testproperties, <https://fusesource-jenkins-rhel7.rhev-ci-vms.eng.rdu2.redhat.com/job/Fuse...]>
-------------------------------------------------------
T E S T S
-------------------------------------------------------
Running org.fusesource.ide.server.tests.bean.FuseESBServerBean6xIT
Tests run: 2, Failures: 0, Errors: 0, Skipped: 0, Time elapsed: 0.057 sec - in org.fusesource.ide.server.tests.bean.FuseESBServerBean6xIT
testFuseESB[0](org.fusesource.ide.server.tests.bean.FuseESBServerBean6xIT) Time elapsed: 0.025 sec
testFuseESB[1](org.fusesource.ide.server.tests.bean.FuseESBServerBean6xIT) Time elapsed: 0.001 sec
Running org.fusesource.ide.server.tests.bean.KarafServerBean3xIT
Tests run: 1, Failures: 0, Errors: 0, Skipped: 0, Time elapsed: 0.008 sec - in org.fusesource.ide.server.tests.bean.KarafServerBean3xIT
testKaraf[0](org.fusesource.ide.server.tests.bean.KarafServerBean3xIT) Time elapsed: 0.004 sec
Running org.fusesource.ide.server.tests.bean.KarafServerBean2xIT
Tests run: 2, Failures: 0, Errors: 0, Skipped: 0, Time elapsed: 0.004 sec - in org.fusesource.ide.server.tests.bean.KarafServerBean2xIT
testKaraf[0](org.fusesource.ide.server.tests.bean.KarafServerBean2xIT) Time elapsed: 0.002 sec
testKaraf[1](org.fusesource.ide.server.tests.bean.KarafServerBean2xIT) Time elapsed: 0.001 sec
Running org.fusesource.ide.server.tests.locator.KarafRuntime2xLocatorIT
Tests run: 2, Failures: 0, Errors: 0, Skipped: 0, Time elapsed: 0.03 sec - in org.fusesource.ide.server.tests.locator.KarafRuntime2xLocatorIT
testKaraf[0](org.fusesource.ide.server.tests.locator.KarafRuntime2xLocatorIT) Time elapsed: 0.023 sec
testKaraf[1](org.fusesource.ide.server.tests.locator.KarafRuntime2xLocatorIT) Time elapsed: 0.004 sec
Running org.fusesource.ide.server.tests.locator.FuseESBRuntime6xLocatorIT
Tests run: 2, Failures: 0, Errors: 0, Skipped: 0, Time elapsed: 0.013 sec - in org.fusesource.ide.server.tests.locator.FuseESBRuntime6xLocatorIT
testFuseESB[0](org.fusesource.ide.server.tests.locator.FuseESBRuntime6xLocatorIT) Time elapsed: 0.008 sec
testFuseESB[1](org.fusesource.ide.server.tests.locator.FuseESBRuntime6xLocatorIT) Time elapsed: 0.004 sec
Running org.fusesource.ide.server.tests.locator.KarafRuntime3xLocatorIT
Tests run: 1, Failures: 0, Errors: 0, Skipped: 0, Time elapsed: 0.008 sec - in org.fusesource.ide.server.tests.locator.KarafRuntime3xLocatorIT
testKaraf[0](org.fusesource.ide.server.tests.locator.KarafRuntime3xLocatorIT) Time elapsed: 0.007 sec
Results :
Tests run: 10, Failures: 0, Errors: 0, Skipped: 0
[INFO] All tests passed!
[INFO]
[INFO] --- jacoco-maven-plugin:0.7.9:report (jacoco-site) @ org.fusesource.ide.server.tests ---
[INFO] Skipping JaCoCo execution due to missing execution data file.
[INFO]
[INFO] --- tycho-p2-extras-plugin:0.26.0:compare-version-with-baselines (default) @ org.fusesource.ide.server.tests ---
[INFO]
[INFO] --- maven-install-plugin:2.3.1:install (default-install) @ org.fusesource.ide.server.tests ---
[INFO] Installing <https://fusesource-jenkins-rhel7.rhev-ci-vms.eng.rdu2.redhat.com/job/Fuse...> to <https://fusesource-jenkins-rhel7.rhev-ci-vms.eng.rdu2.redhat.com/job/Fuse...>
[INFO] Installing <https://fusesource-jenkins-rhel7.rhev-ci-vms.eng.rdu2.redhat.com/job/Fuse...> to <https://fusesource-jenkins-rhel7.rhev-ci-vms.eng.rdu2.redhat.com/job/Fuse...>
[INFO] Installing <https://fusesource-jenkins-rhel7.rhev-ci-vms.eng.rdu2.redhat.com/job/Fuse...> to <https://fusesource-jenkins-rhel7.rhev-ci-vms.eng.rdu2.redhat.com/job/Fuse...>
[INFO] Installing <https://fusesource-jenkins-rhel7.rhev-ci-vms.eng.rdu2.redhat.com/job/Fuse...> to <https://fusesource-jenkins-rhel7.rhev-ci-vms.eng.rdu2.redhat.com/job/Fuse...>
[INFO] Installing <https://fusesource-jenkins-rhel7.rhev-ci-vms.eng.rdu2.redhat.com/job/Fuse...> to <https://fusesource-jenkins-rhel7.rhev-ci-vms.eng.rdu2.redhat.com/job/Fuse...>
[INFO] Installing <https://fusesource-jenkins-rhel7.rhev-ci-vms.eng.rdu2.redhat.com/job/Fuse...> to <https://fusesource-jenkins-rhel7.rhev-ci-vms.eng.rdu2.redhat.com/job/Fuse...>
[INFO] Installing <https://fusesource-jenkins-rhel7.rhev-ci-vms.eng.rdu2.redhat.com/job/Fuse...> to <https://fusesource-jenkins-rhel7.rhev-ci-vms.eng.rdu2.redhat.com/job/Fuse...>
[INFO]
[INFO] --- tycho-p2-plugin:0.26.0:update-local-index (default-update-local-index) @ org.fusesource.ide.server.tests ---
[INFO]
[INFO] ------------------------------------------------------------------------
[INFO] Building JBoss Fuse Tooling :: Update Site 9.2.0-SNAPSHOT
[INFO] ------------------------------------------------------------------------
[INFO]
[INFO] --- maven-clean-plugin:3.0.0:clean (default-clean) @ org.fusesource.ide.updatesite ---
[INFO]
[INFO] --- tycho-packaging-plugin:0.26.0:build-qualifier-aggregator (default-build-qualifier-aggregator) @ org.fusesource.ide.updatesite ---
[INFO] The project's OSGi version is 9.2.0.CI-v20170327-0751-B91
[INFO]
[INFO] --- build-helper-maven-plugin:1.7:regex-property (regex-property) @ org.fusesource.ide.updatesite ---
[INFO] Setting property 'skipTestsOrITests' to ''.
[INFO]
[INFO] --- maven-enforcer-plugin:1.4.1:enforce (core-has-ui-deps) @ org.fusesource.ide.updatesite ---
[INFO]
[INFO] --- maven-enforcer-plugin:1.4.1:enforce (warn-no-snapshots-AMx) @ org.fusesource.ide.updatesite ---
[ERROR] Found property update.site.version = 9.2.0-SNAPSHOT.CI
[INFO]
[INFO] --- maven-enforcer-plugin:1.4.1:enforce (enforce-no-snapshots-Final) @ org.fusesource.ide.updatesite ---
[ERROR] Found property update.site.version = 9.2.0-SNAPSHOT.CI
[INFO]
[INFO] --- maven-clean-plugin:3.0.0:clean (default-clean-1) @ org.fusesource.ide.updatesite ---
[INFO]
[INFO] --- jacoco-maven-plugin:0.7.9:prepare-agent (default) @ org.fusesource.ide.updatesite ---
[INFO] argLine set to -javaagent:<https://fusesource-jenkins-rhel7.rhev-ci-vms.eng.rdu2.redhat.com/job/Fuse...>
[INFO]
[INFO] --- jacoco-maven-plugin:0.7.9:prepare-agent (agent-for-ut) @ org.fusesource.ide.updatesite ---
[INFO] argLine set to -javaagent:<https://fusesource-jenkins-rhel7.rhev-ci-vms.eng.rdu2.redhat.com/job/Fuse...>:org.jboss.tools.fuse.*
[INFO]
[INFO] --- maven-resources-plugin:2.7:resources (default-resources) @ org.fusesource.ide.updatesite ---
[INFO] Using 'UTF-8' encoding to copy filtered resources.
[INFO] skip non existing resourceDirectory <https://fusesource-jenkins-rhel7.rhev-ci-vms.eng.rdu2.redhat.com/job/Fuse...>
[INFO]
[INFO] --- maven-compiler-plugin:3.5.1:testCompile (compiletests) @ org.fusesource.ide.updatesite ---
[INFO] No sources to compile
[INFO]
[INFO] --- maven-surefire-plugin:2.19.1:test (test) @ org.fusesource.ide.updatesite ---
[INFO] No tests to run.
[INFO]
[INFO] --- tycho-source-plugin:0.26.0:plugin-source (plugin-source) @ org.fusesource.ide.updatesite ---
[INFO]
[INFO] --- target-platform-configuration:0.26.0:target-platform (default-target-platform) @ org.fusesource.ide.updatesite ---
[INFO]
[INFO] --- tycho-p2-publisher-plugin:0.26.0:publish-products (default-publish-products) @ org.fusesource.ide.updatesite ---
[INFO]
[INFO] --- tycho-p2-publisher-plugin:0.26.0:publish-categories (default-publish-categories) @ org.fusesource.ide.updatesite ---
[INFO]
[INFO] --- tycho-p2-publisher-plugin:0.26.0:attach-artifacts (default-attach-artifacts) @ org.fusesource.ide.updatesite ---
[INFO]
[INFO] --- tycho-p2-repository-plugin:0.26.0:assemble-repository (default-assemble-repository) @ org.fusesource.ide.updatesite ---
[INFO]
[INFO] --- tycho-p2-repository-plugin:0.26.0:archive-repository (default-archive-repository) @ org.fusesource.ide.updatesite ---
[INFO] Building zip: <https://fusesource-jenkins-rhel7.rhev-ci-vms.eng.rdu2.redhat.com/job/Fuse...>
[INFO]
[INFO] --- tycho-source-feature-plugin:0.26.0:source-feature (source-feature) @ org.fusesource.ide.updatesite ---
[INFO]
[INFO] --- tycho-p2-plugin:0.26.0:p2-metadata (attached-p2-metadata) @ org.fusesource.ide.updatesite ---
[INFO]
[INFO] --- repository-utils:0.26.0:generate-repository-facade (generate-facade) @ org.fusesource.ide.updatesite ---
[INFO] Building zip: <https://fusesource-jenkins-rhel7.rhev-ci-vms.eng.rdu2.redhat.com/job/Fuse...>
[INFO]
[INFO] --- jacoco-maven-plugin:0.7.9:prepare-agent-integration (agent-for-it) @ org.fusesource.ide.updatesite ---
[INFO] argLine set to -javaagent:<https://fusesource-jenkins-rhel7.rhev-ci-vms.eng.rdu2.redhat.com/job/Fuse...>:org.jboss.tools.fuse.*
[INFO]
[INFO] --- jacoco-maven-plugin:0.7.9:report (jacoco-site) @ org.fusesource.ide.updatesite ---
[INFO] Skipping JaCoCo execution due to missing execution data file.
[INFO]
[INFO] --- tycho-p2-extras-plugin:0.26.0:compare-version-with-baselines (default) @ org.fusesource.ide.updatesite ---
[INFO]
[INFO] --- maven-install-plugin:2.3.1:install (default-install) @ org.fusesource.ide.updatesite ---
[INFO] Installing <https://fusesource-jenkins-rhel7.rhev-ci-vms.eng.rdu2.redhat.com/job/Fuse...> to <https://fusesource-jenkins-rhel7.rhev-ci-vms.eng.rdu2.redhat.com/job/Fuse...>
[INFO] Installing <https://fusesource-jenkins-rhel7.rhev-ci-vms.eng.rdu2.redhat.com/job/Fuse...> to <https://fusesource-jenkins-rhel7.rhev-ci-vms.eng.rdu2.redhat.com/job/Fuse...>
[INFO] Installing <https://fusesource-jenkins-rhel7.rhev-ci-vms.eng.rdu2.redhat.com/job/Fuse...> to <https://fusesource-jenkins-rhel7.rhev-ci-vms.eng.rdu2.redhat.com/job/Fuse...>
[INFO] Installing <https://fusesource-jenkins-rhel7.rhev-ci-vms.eng.rdu2.redhat.com/job/Fuse...> to <https://fusesource-jenkins-rhel7.rhev-ci-vms.eng.rdu2.redhat.com/job/Fuse...>
[INFO]
[INFO] --- tycho-p2-plugin:0.26.0:update-local-index (default-update-local-index) @ org.fusesource.ide.updatesite ---
[INFO] ------------------------------------------------------------------------
[INFO] Reactor Summary:
[INFO]
[INFO] JBoss Fuse Tooling :: Build Configuration .......... SUCCESS [ 11.311 s]
[INFO] JBoss Fuse Tooling ................................. SUCCESS [ 24.694 s]
[INFO] JBoss Fuse Tooling :: Tools ........................ SUCCESS [ 0.014 s]
[INFO] JBoss Fuse Tooling :: Tools :: IDE Camel Catalog Generator SUCCESS [01:50 min]
[INFO] JBoss Fuse Tooling :: Core ......................... SUCCESS [ 0.013 s]
[INFO] JBoss Fuse Tooling :: Core :: Plugins .............. SUCCESS [ 0.039 s]
[INFO] JBoss Fuse Tooling :: Core :: Plugins :: Foundation Core SUCCESS [ 17.189 s]
[INFO] JBoss Fuse Tooling :: Core :: Plugins :: Preferences SUCCESS [ 0.196 s]
[INFO] JBoss Fuse Tooling :: Core :: Plugins :: Foundation UI SUCCESS [ 0.853 s]
[INFO] JBoss Fuse Tooling :: Core :: Plugins :: Camel Model Service API SUCCESS [ 9.823 s]
[INFO] JBoss Fuse Tooling :: Core :: Plugins :: Camel 2.15.1.redhat-621084 Service Implementation SUCCESS [ 2.340 s]
[INFO] JBoss Fuse Tooling :: Core :: Plugins :: Camel 2.15.1.redhat-621117 Service Implementation SUCCESS [ 1.851 s]
[INFO] JBoss Fuse Tooling :: Core :: Plugins :: Camel 2.17.0.redhat-630187 Service Implementation SUCCESS [ 20.151 s]
[INFO] JBoss Fuse Tooling :: Core :: Plugins :: Camel 2.17.0.redhat-630224 Service Implementation SUCCESS [ 22.753 s]
[INFO] JBoss Fuse Tooling :: Core :: Plugins :: Camel 2.17.3 Service Implementation SUCCESS [ 4.640 s]
[INFO] JBoss Fuse Tooling :: Core :: Plugins :: Camel 2.18.1.redhat-000012 Service Implementation SUCCESS [ 16.813 s]
[INFO] JBoss Fuse Tooling :: Core :: Plugins :: Maven ..... SUCCESS [ 0.274 s]
[INFO] JBoss Fuse Tooling :: Camel Editor ................. SUCCESS [ 0.012 s]
[INFO] JBoss Fuse Tooling :: Camel Editor :: Plugins ...... SUCCESS [ 0.025 s]
[INFO] JBoss Fuse Tooling :: Camel Editor :: Plugins :: Branding SUCCESS [ 0.530 s]
[INFO] JBoss Fuse Tooling :: Core :: Plugins :: Camel Validation SUCCESS [ 0.373 s]
[INFO] JBoss Fuse Tooling :: Core :: Plugins :: Cheat Sheets SUCCESS [ 0.092 s]
[INFO] JBoss Fuse Tooling :: Core :: Plugins :: Graph ..... SUCCESS [ 0.302 s]
[INFO] JBoss Fuse Tooling :: Core :: Plugins :: Help ...... SUCCESS [ 4.385 s]
[INFO] JBoss Fuse Tooling :: Core :: Plugins :: Imports ... SUCCESS [ 0.272 s]
[INFO] JBoss Fuse Tooling :: Core :: Plugins :: Branding .. SUCCESS [ 0.089 s]
[INFO] JBoss Fuse Tooling :: Core :: Tests ................ SUCCESS [ 0.010 s]
[INFO] JBoss Fuse Tooling :: Core :: Tests :: Camel Service Core Tests SUCCESS [ 2.790 s]
[INFO] JBoss Fuse Tooling :: JMX .......................... SUCCESS [ 0.011 s]
[INFO] JBoss Fuse Tooling :: JMX :: Plugins ............... SUCCESS [ 0.009 s]
[INFO] JBoss Fuse Tooling :: JMX :: Plugins :: JMX Commons SUCCESS [ 0.426 s]
[INFO] JBoss Fuse Tooling :: Camel Editor :: Plugins :: Launcher SUCCESS [ 0.434 s]
[INFO] JBoss Fuse Tooling :: Camel Editor :: Plugins :: Camel Editor SUCCESS [ 0.957 s]
[INFO] JBoss Fuse Tooling :: Core :: Tests :: Camel Service Core Integration Tests SUCCESS [01:04 min]
[INFO] JBoss Fuse Tooling :: Core :: Tests :: Camel Model Tests SUCCESS [ 8.453 s]
[INFO] JBoss Fuse Tooling :: Core :: Tests :: Camel Validation Integration Tests SUCCESS [ 0.523 s]
[INFO] JBoss Fuse Tooling :: Core :: Tests :: Camel Validation Tests SUCCESS [ 1.742 s]
[INFO] JBoss Fuse Tooling :: Camel Editor :: Plugins :: Project SUCCESS [ 0.444 s]
[INFO] JBoss Fuse Tooling :: Camel Editor :: Plugins :: Project Templates SUCCESS [ 3.381 s]
[INFO] JBoss Fuse Tooling :: Camel Editor :: Tests ........ SUCCESS [ 0.012 s]
[INFO] JBoss Fuse Tooling :: Camel Editor :: Tests :: Camel Editor Integration Tests SUCCESS [05:35 min]
[INFO] JBoss Fuse Tooling :: Core :: Tests :: Camel Validation Integration Tests SUCCESS [ 15.791 s]
[INFO] JBoss Fuse Tooling :: Core :: Features ............. SUCCESS [ 0.018 s]
[INFO] JBoss Fuse Tooling :: Core :: Features :: Core Feature SUCCESS [ 0.304 s]
[INFO] JBoss Fuse Tooling :: Camel Editor :: Plugins :: XSD Catalogs SUCCESS [ 0.136 s]
[INFO] JBoss Fuse Tooling :: Camel Editor :: Plugins :: Launcher UI SUCCESS [ 0.368 s]
[INFO] JBoss Fuse Tooling :: Camel Editor :: Tests :: Camel Editor Tests SUCCESS [ 3.948 s]
[INFO] JBoss Fuse Tooling :: Camel Editor :: Tests :: Camel IDE Launcher Tests SUCCESS [ 1.913 s]
[INFO] JBoss Fuse Tooling :: Camel Editor :: Tests :: Launcher UI Tests SUCCESS [ 1.959 s]
[INFO] JBoss Fuse Tooling :: Camel Editor :: Tests :: Camel IDE Launcher UI Integration Tests SUCCESS [ 9.309 s]
[INFO] JBoss Fuse Tooling :: Camel Editor :: Tests :: Camel IDE Project Integration Tests SUCCESS [ 9.862 s]
[INFO] JBoss Fuse Tooling :: Camel Editor :: Tests :: Project Templates Tests SUCCESS [ 1.923 s]
[INFO] JBoss Fuse Tooling :: Camel Editor :: Tests :: Project Templates Integration Tests FAILURE [18:40 min]
[INFO] JBoss Fuse Tooling :: Camel Editor :: Features ..... SUCCESS [ 0.012 s]
[INFO] JBoss Fuse Tooling :: Camel Editor :: Features :: Camel Editor Feature SUCCESS [ 0.238 s]
[INFO] JBoss Fuse Tooling :: Data Transformation .......... SUCCESS [ 0.011 s]
[INFO] JBoss Fuse Tooling :: Data Transformation :: Plugins SUCCESS [ 0.010 s]
[INFO] JBoss Fuse Tooling :: Data Transformation :: Plugins :: Core SUCCESS [ 2.744 s]
[INFO] JBoss Fuse Tooling :: Data Transformation :: Plugins :: Editor SUCCESS [ 0.855 s]
[INFO] JBoss Fuse Tooling :: Data Transformation :: Features SUCCESS [ 0.011 s]
[INFO] JBoss Fuse Tooling :: Data Transformation :: Features :: Data Transformation Feature SUCCESS [ 0.224 s]
[INFO] JBoss Fuse Tooling :: Core Transformation :: Tests . SUCCESS [ 0.009 s]
[INFO] JBoss Fuse Tooling :: Core Transformation :: Tests :: Core Transformation Tests SUCCESS [ 2.941 s]
[INFO] JBoss Fuse Tooling :: Core Transformation :: Tests :: Core Transformation Integration Tests SUCCESS [ 9.401 s]
[INFO] JBoss Fuse Tooling :: Editor Transformation :: Tests :: Editor Transformation Tests SUCCESS [ 1.699 s]
[INFO] JBoss Fuse Tooling :: Transformation Editor :: Tests :: Transformation Editor Integration Tests SUCCESS [ 10.701 s]
[INFO] JBoss Fuse Tooling :: JMX :: Plugins :: Apache ActiveMQ Facade SUCCESS [ 8.657 s]
[INFO] JBoss Fuse Tooling :: JMX :: Plugins :: Apache Camel Facade SUCCESS [ 0.456 s]
[INFO] JBoss Fuse Tooling :: JMX :: Plugins :: JMX Diagram View SUCCESS [ 0.383 s]
[INFO] JBoss Fuse Tooling :: Server Adapters .............. SUCCESS [ 0.009 s]
[INFO] JBoss Fuse Tooling :: Server Adapters :: Plugins ... SUCCESS [ 0.008 s]
[INFO] JBoss Fuse Tooling :: Server Adapters :: Plugins :: Apache Karaf Adapter Core SUCCESS [ 0.457 s]
[INFO] JBoss Fuse Tooling :: JMX :: Plugins :: Apache Karaf Facade SUCCESS [ 0.419 s]
[INFO] JBoss Fuse Tooling :: JMX :: Tests ................. SUCCESS [ 0.010 s]
[INFO] JBoss Fuse Tooling :: JMX :: Tests ::Camel ......... SUCCESS [ 1.516 s]
[INFO] JBoss Fuse Tooling :: JMX :: Integration Tests :: Camel SUCCESS [ 7.427 s]
[INFO] JBoss Fuse Tooling :: JMX :: Tests :: Commons ...... SUCCESS [ 1.714 s]
[INFO] JBoss Fuse Tooling :: JMX :: Tests :: Diagram ::View SUCCESS [ 1.828 s]
[INFO] JBoss Fuse Tooling :: JMX :: Features .............. SUCCESS [ 0.008 s]
[INFO] JBoss Fuse Tooling :: Server Adapters :: Plugins :: Commons SUCCESS [ 0.349 s]
[INFO] JBoss Fuse Tooling :: Server Adapters :: Plugins :: Apache Karaf Adapter UI SUCCESS [ 0.510 s]
[INFO] JBoss Fuse Tooling :: Server Adapters :: Plugins :: JBoss Fuse Adapter Core SUCCESS [ 0.341 s]
[INFO] JBoss Fuse Tooling :: Server Adapters :: Plugins :: JBoss Fuse Adapter UI SUCCESS [ 0.369 s]
[INFO] JBoss Fuse Tooling :: Server Adapters :: Features .. SUCCESS [ 0.010 s]
[INFO] JBoss Fuse Tooling :: Server Adapters :: Features :: Server Adapters Feature SUCCESS [ 0.208 s]
[INFO] JBoss Fuse Tooling :: JMX :: Features :: JMX Feature SUCCESS [ 0.264 s]
[INFO] JBoss Fuse Tooling :: Server Adapters :: Tests ..... SUCCESS [ 0.009 s]
[INFO] JBoss Fuse Tooling :: Server Adapters :: Tests :: Karaf Core Tests SUCCESS [ 1.694 s]
[INFO] JBoss Fuse Tooling :: Server Adapters :: Tests :: Server Tests SUCCESS [ 9.842 s]
[INFO] JBoss Fuse Tooling :: Update Site .................. SUCCESS [ 9.829 s]
[INFO] ------------------------------------------------------------------------
[INFO] BUILD FAILURE
[INFO] ------------------------------------------------------------------------
[INFO] Total time: 40:35 min
[INFO] Finished at: 2017-03-27T04:41:59-04:00
[INFO] Final Memory: 324M/728M
[INFO] ------------------------------------------------------------------------
[ERROR] Failed to execute goal org.eclipse.tycho:tycho-surefire-plugin:0.26.0:test (default-test) on project org.fusesource.ide.projecttemplates.tests.integration: There are test failures.
[ERROR]
[ERROR] Please refer to <https://fusesource-jenkins-rhel7.rhev-ci-vms.eng.rdu2.redhat.com/job/Fuse...> for the individual test results.
[ERROR] -> [Help 1]
[ERROR]
[ERROR] To see the full stack trace of the errors, re-run Maven with the -e switch.
[ERROR] Re-run Maven using the -X switch to enable full debug logging.
[ERROR]
[ERROR] For more information about the errors and possible solutions, please read the following articles:
[ERROR] [Help 1] http://cwiki.apache.org/confluence/display/MAVEN/MojoFailureException
[ERROR]
[ERROR] After correcting the problems, you can resume the build with the command
[ERROR] mvn <goals> -rf :org.fusesource.ide.projecttemplates.tests.integration
Build step 'Invoke top-level Maven targets' marked build as failure
Terminating xvnc.
$ vncserver -kill :13
Killing Xvnc process ID 3496
Archiving artifacts
Recording test results
7 years, 11 months
Build failed in Jenkins: Fuse-Tooling-9.2.x-Update-Site #88
by Fuse Infra Team
See <https://fusesource-jenkins-rhel7.rhev-ci-vms.eng.rdu2.redhat.com/job/Fuse...>
Changes:
[Aurelien Pupier] Remove conditions which always evaluate to same value
------------------------------------------
[...truncated 21860 lines...]
[INFO] tycho.testArgLine set to -javaagent:<https://fusesource-jenkins-rhel7.rhev-ci-vms.eng.rdu2.redhat.com/job/Fuse...>:org.jboss.tools.fuse.*
[INFO]
[INFO] --- tycho-surefire-plugin:0.26.0:test (default-test) @ org.fusesource.ide.server.tests ---
[INFO] Expected eclipse log file: <https://fusesource-jenkins-rhel7.rhev-ci-vms.eng.rdu2.redhat.com/job/Fuse...> sp(a)xn--c/-bja.metadata/.log
[INFO] Command line:
[/usr/lib/jvm/java-1.8.0-openjdk-1.8.0.121-0.b13.el7_3.x86_64/jre/bin/java, -Dosgi.noShutdown=false, -Dosgi.os=linux, -Dosgi.ws=gtk, -Dosgi.arch=x86_64, -javaagent:<https://fusesource-jenkins-rhel7.rhev-ci-vms.eng.rdu2.redhat.com/job/Fuse...>:org.jboss.tools.fuse.*, -XX:+HeapDumpOnOutOfMemoryError, -Dusage_reporting_enabled=false, -Dorg.jboss.tools.vpe.loadxulrunner=false, -Dosgi.clean=true, -jar, <https://fusesource-jenkins-rhel7.rhev-ci-vms.eng.rdu2.redhat.com/job/Fuse...,> -data, <https://fusesource-jenkins-rhel7.rhev-ci-vms.eng.rdu2.redhat.com/job/Fuse...> sp@cé, -install, <https://fusesource-jenkins-rhel7.rhev-ci-vms.eng.rdu2.redhat.com/job/Fuse...,> -configuration, <https://fusesource-jenkins-rhel7.rhev-ci-vms.eng.rdu2.redhat.com/job/Fuse...,> -application, org.eclipse.tycho.surefire.osgibooter.uitest, -testproperties, <https://fusesource-jenkins-rhel7.rhev-ci-vms.eng.rdu2.redhat.com/job/Fuse...]>
-------------------------------------------------------
T E S T S
-------------------------------------------------------
Running org.fusesource.ide.server.tests.bean.FuseESBServerBean6xIT
Tests run: 2, Failures: 0, Errors: 0, Skipped: 0, Time elapsed: 0.054 sec - in org.fusesource.ide.server.tests.bean.FuseESBServerBean6xIT
testFuseESB[0](org.fusesource.ide.server.tests.bean.FuseESBServerBean6xIT) Time elapsed: 0.024 sec
testFuseESB[1](org.fusesource.ide.server.tests.bean.FuseESBServerBean6xIT) Time elapsed: 0.001 sec
Running org.fusesource.ide.server.tests.bean.KarafServerBean3xIT
Tests run: 1, Failures: 0, Errors: 0, Skipped: 0, Time elapsed: 0.008 sec - in org.fusesource.ide.server.tests.bean.KarafServerBean3xIT
testKaraf[0](org.fusesource.ide.server.tests.bean.KarafServerBean3xIT) Time elapsed: 0.004 sec
Running org.fusesource.ide.server.tests.bean.KarafServerBean2xIT
Tests run: 2, Failures: 0, Errors: 0, Skipped: 0, Time elapsed: 0.008 sec - in org.fusesource.ide.server.tests.bean.KarafServerBean2xIT
testKaraf[0](org.fusesource.ide.server.tests.bean.KarafServerBean2xIT) Time elapsed: 0.002 sec
testKaraf[1](org.fusesource.ide.server.tests.bean.KarafServerBean2xIT) Time elapsed: 0.005 sec
Running org.fusesource.ide.server.tests.locator.KarafRuntime2xLocatorIT
Tests run: 2, Failures: 0, Errors: 0, Skipped: 0, Time elapsed: 0.029 sec - in org.fusesource.ide.server.tests.locator.KarafRuntime2xLocatorIT
testKaraf[0](org.fusesource.ide.server.tests.locator.KarafRuntime2xLocatorIT) Time elapsed: 0.022 sec
testKaraf[1](org.fusesource.ide.server.tests.locator.KarafRuntime2xLocatorIT) Time elapsed: 0.005 sec
Running org.fusesource.ide.server.tests.locator.FuseESBRuntime6xLocatorIT
Tests run: 2, Failures: 0, Errors: 0, Skipped: 0, Time elapsed: 0.012 sec - in org.fusesource.ide.server.tests.locator.FuseESBRuntime6xLocatorIT
testFuseESB[0](org.fusesource.ide.server.tests.locator.FuseESBRuntime6xLocatorIT) Time elapsed: 0.008 sec
testFuseESB[1](org.fusesource.ide.server.tests.locator.FuseESBRuntime6xLocatorIT) Time elapsed: 0.003 sec
Running org.fusesource.ide.server.tests.locator.KarafRuntime3xLocatorIT
Tests run: 1, Failures: 0, Errors: 0, Skipped: 0, Time elapsed: 0.008 sec - in org.fusesource.ide.server.tests.locator.KarafRuntime3xLocatorIT
testKaraf[0](org.fusesource.ide.server.tests.locator.KarafRuntime3xLocatorIT) Time elapsed: 0.007 sec
Results :
Tests run: 10, Failures: 0, Errors: 0, Skipped: 0
[INFO] All tests passed!
[INFO]
[INFO] --- jacoco-maven-plugin:0.7.9:report (jacoco-site) @ org.fusesource.ide.server.tests ---
[INFO] Skipping JaCoCo execution due to missing execution data file.
[INFO]
[INFO] --- tycho-p2-extras-plugin:0.26.0:compare-version-with-baselines (default) @ org.fusesource.ide.server.tests ---
[INFO]
[INFO] --- maven-install-plugin:2.3.1:install (default-install) @ org.fusesource.ide.server.tests ---
[INFO] Installing <https://fusesource-jenkins-rhel7.rhev-ci-vms.eng.rdu2.redhat.com/job/Fuse...> to <https://fusesource-jenkins-rhel7.rhev-ci-vms.eng.rdu2.redhat.com/job/Fuse...>
[INFO] Installing <https://fusesource-jenkins-rhel7.rhev-ci-vms.eng.rdu2.redhat.com/job/Fuse...> to <https://fusesource-jenkins-rhel7.rhev-ci-vms.eng.rdu2.redhat.com/job/Fuse...>
[INFO] Installing <https://fusesource-jenkins-rhel7.rhev-ci-vms.eng.rdu2.redhat.com/job/Fuse...> to <https://fusesource-jenkins-rhel7.rhev-ci-vms.eng.rdu2.redhat.com/job/Fuse...>
[INFO] Installing <https://fusesource-jenkins-rhel7.rhev-ci-vms.eng.rdu2.redhat.com/job/Fuse...> to <https://fusesource-jenkins-rhel7.rhev-ci-vms.eng.rdu2.redhat.com/job/Fuse...>
[INFO] Installing <https://fusesource-jenkins-rhel7.rhev-ci-vms.eng.rdu2.redhat.com/job/Fuse...> to <https://fusesource-jenkins-rhel7.rhev-ci-vms.eng.rdu2.redhat.com/job/Fuse...>
[INFO] Installing <https://fusesource-jenkins-rhel7.rhev-ci-vms.eng.rdu2.redhat.com/job/Fuse...> to <https://fusesource-jenkins-rhel7.rhev-ci-vms.eng.rdu2.redhat.com/job/Fuse...>
[INFO] Installing <https://fusesource-jenkins-rhel7.rhev-ci-vms.eng.rdu2.redhat.com/job/Fuse...> to <https://fusesource-jenkins-rhel7.rhev-ci-vms.eng.rdu2.redhat.com/job/Fuse...>
[INFO]
[INFO] --- tycho-p2-plugin:0.26.0:update-local-index (default-update-local-index) @ org.fusesource.ide.server.tests ---
[INFO]
[INFO] ------------------------------------------------------------------------
[INFO] Building JBoss Fuse Tooling :: Update Site 9.2.0-SNAPSHOT
[INFO] ------------------------------------------------------------------------
[INFO]
[INFO] --- maven-clean-plugin:3.0.0:clean (default-clean) @ org.fusesource.ide.updatesite ---
[INFO]
[INFO] --- tycho-packaging-plugin:0.26.0:build-qualifier-aggregator (default-build-qualifier-aggregator) @ org.fusesource.ide.updatesite ---
[INFO] The project's OSGi version is 9.2.0.CI-v20170324-1633-B88
[INFO]
[INFO] --- build-helper-maven-plugin:1.7:regex-property (regex-property) @ org.fusesource.ide.updatesite ---
[INFO] Setting property 'skipTestsOrITests' to ''.
[INFO]
[INFO] --- maven-enforcer-plugin:1.4.1:enforce (core-has-ui-deps) @ org.fusesource.ide.updatesite ---
[INFO]
[INFO] --- maven-enforcer-plugin:1.4.1:enforce (warn-no-snapshots-AMx) @ org.fusesource.ide.updatesite ---
[ERROR] Found property update.site.version = 9.2.0-SNAPSHOT.CI
[INFO]
[INFO] --- maven-enforcer-plugin:1.4.1:enforce (enforce-no-snapshots-Final) @ org.fusesource.ide.updatesite ---
[ERROR] Found property update.site.version = 9.2.0-SNAPSHOT.CI
[INFO]
[INFO] --- maven-clean-plugin:3.0.0:clean (default-clean-1) @ org.fusesource.ide.updatesite ---
[INFO]
[INFO] --- jacoco-maven-plugin:0.7.9:prepare-agent (default) @ org.fusesource.ide.updatesite ---
[INFO] argLine set to -javaagent:<https://fusesource-jenkins-rhel7.rhev-ci-vms.eng.rdu2.redhat.com/job/Fuse...>
[INFO]
[INFO] --- jacoco-maven-plugin:0.7.9:prepare-agent (agent-for-ut) @ org.fusesource.ide.updatesite ---
[INFO] argLine set to -javaagent:<https://fusesource-jenkins-rhel7.rhev-ci-vms.eng.rdu2.redhat.com/job/Fuse...>:org.jboss.tools.fuse.*
[INFO]
[INFO] --- maven-resources-plugin:2.7:resources (default-resources) @ org.fusesource.ide.updatesite ---
[INFO] Using 'UTF-8' encoding to copy filtered resources.
[INFO] skip non existing resourceDirectory <https://fusesource-jenkins-rhel7.rhev-ci-vms.eng.rdu2.redhat.com/job/Fuse...>
[INFO]
[INFO] --- maven-compiler-plugin:3.5.1:testCompile (compiletests) @ org.fusesource.ide.updatesite ---
[INFO] No sources to compile
[INFO]
[INFO] --- maven-surefire-plugin:2.19.1:test (test) @ org.fusesource.ide.updatesite ---
[INFO] No tests to run.
[INFO]
[INFO] --- tycho-source-plugin:0.26.0:plugin-source (plugin-source) @ org.fusesource.ide.updatesite ---
[INFO]
[INFO] --- target-platform-configuration:0.26.0:target-platform (default-target-platform) @ org.fusesource.ide.updatesite ---
[INFO]
[INFO] --- tycho-p2-publisher-plugin:0.26.0:publish-products (default-publish-products) @ org.fusesource.ide.updatesite ---
[INFO]
[INFO] --- tycho-p2-publisher-plugin:0.26.0:publish-categories (default-publish-categories) @ org.fusesource.ide.updatesite ---
[INFO]
[INFO] --- tycho-p2-publisher-plugin:0.26.0:attach-artifacts (default-attach-artifacts) @ org.fusesource.ide.updatesite ---
[INFO]
[INFO] --- tycho-p2-repository-plugin:0.26.0:assemble-repository (default-assemble-repository) @ org.fusesource.ide.updatesite ---
[INFO]
[INFO] --- tycho-p2-repository-plugin:0.26.0:archive-repository (default-archive-repository) @ org.fusesource.ide.updatesite ---
[INFO] Building zip: <https://fusesource-jenkins-rhel7.rhev-ci-vms.eng.rdu2.redhat.com/job/Fuse...>
[INFO]
[INFO] --- tycho-source-feature-plugin:0.26.0:source-feature (source-feature) @ org.fusesource.ide.updatesite ---
[INFO]
[INFO] --- tycho-p2-plugin:0.26.0:p2-metadata (attached-p2-metadata) @ org.fusesource.ide.updatesite ---
[INFO]
[INFO] --- repository-utils:0.26.0:generate-repository-facade (generate-facade) @ org.fusesource.ide.updatesite ---
[INFO] Building zip: <https://fusesource-jenkins-rhel7.rhev-ci-vms.eng.rdu2.redhat.com/job/Fuse...>
[INFO]
[INFO] --- jacoco-maven-plugin:0.7.9:prepare-agent-integration (agent-for-it) @ org.fusesource.ide.updatesite ---
[INFO] argLine set to -javaagent:<https://fusesource-jenkins-rhel7.rhev-ci-vms.eng.rdu2.redhat.com/job/Fuse...>:org.jboss.tools.fuse.*
[INFO]
[INFO] --- jacoco-maven-plugin:0.7.9:report (jacoco-site) @ org.fusesource.ide.updatesite ---
[INFO] Skipping JaCoCo execution due to missing execution data file.
[INFO]
[INFO] --- tycho-p2-extras-plugin:0.26.0:compare-version-with-baselines (default) @ org.fusesource.ide.updatesite ---
[INFO]
[INFO] --- maven-install-plugin:2.3.1:install (default-install) @ org.fusesource.ide.updatesite ---
[INFO] Installing <https://fusesource-jenkins-rhel7.rhev-ci-vms.eng.rdu2.redhat.com/job/Fuse...> to <https://fusesource-jenkins-rhel7.rhev-ci-vms.eng.rdu2.redhat.com/job/Fuse...>
[INFO] Installing <https://fusesource-jenkins-rhel7.rhev-ci-vms.eng.rdu2.redhat.com/job/Fuse...> to <https://fusesource-jenkins-rhel7.rhev-ci-vms.eng.rdu2.redhat.com/job/Fuse...>
[INFO] Installing <https://fusesource-jenkins-rhel7.rhev-ci-vms.eng.rdu2.redhat.com/job/Fuse...> to <https://fusesource-jenkins-rhel7.rhev-ci-vms.eng.rdu2.redhat.com/job/Fuse...>
[INFO] Installing <https://fusesource-jenkins-rhel7.rhev-ci-vms.eng.rdu2.redhat.com/job/Fuse...> to <https://fusesource-jenkins-rhel7.rhev-ci-vms.eng.rdu2.redhat.com/job/Fuse...>
[INFO]
[INFO] --- tycho-p2-plugin:0.26.0:update-local-index (default-update-local-index) @ org.fusesource.ide.updatesite ---
[INFO] ------------------------------------------------------------------------
[INFO] Reactor Summary:
[INFO]
[INFO] JBoss Fuse Tooling :: Build Configuration .......... SUCCESS [ 10.837 s]
[INFO] JBoss Fuse Tooling ................................. SUCCESS [ 24.750 s]
[INFO] JBoss Fuse Tooling :: Tools ........................ SUCCESS [ 0.014 s]
[INFO] JBoss Fuse Tooling :: Tools :: IDE Camel Catalog Generator SUCCESS [01:46 min]
[INFO] JBoss Fuse Tooling :: Core ......................... SUCCESS [ 0.014 s]
[INFO] JBoss Fuse Tooling :: Core :: Plugins .............. SUCCESS [ 0.012 s]
[INFO] JBoss Fuse Tooling :: Core :: Plugins :: Foundation Core SUCCESS [ 10.784 s]
[INFO] JBoss Fuse Tooling :: Core :: Plugins :: Preferences SUCCESS [ 0.206 s]
[INFO] JBoss Fuse Tooling :: Core :: Plugins :: Foundation UI SUCCESS [ 0.890 s]
[INFO] JBoss Fuse Tooling :: Core :: Plugins :: Camel Model Service API SUCCESS [ 8.379 s]
[INFO] JBoss Fuse Tooling :: Core :: Plugins :: Camel 2.15.1.redhat-621084 Service Implementation SUCCESS [ 2.314 s]
[INFO] JBoss Fuse Tooling :: Core :: Plugins :: Camel 2.15.1.redhat-621117 Service Implementation SUCCESS [ 1.877 s]
[INFO] JBoss Fuse Tooling :: Core :: Plugins :: Camel 2.17.0.redhat-630187 Service Implementation SUCCESS [ 15.498 s]
[INFO] JBoss Fuse Tooling :: Core :: Plugins :: Camel 2.17.0.redhat-630224 Service Implementation SUCCESS [ 14.150 s]
[INFO] JBoss Fuse Tooling :: Core :: Plugins :: Camel 2.17.3 Service Implementation SUCCESS [ 5.187 s]
[INFO] JBoss Fuse Tooling :: Core :: Plugins :: Camel 2.18.1.redhat-000012 Service Implementation SUCCESS [ 13.260 s]
[INFO] JBoss Fuse Tooling :: Core :: Plugins :: Maven ..... SUCCESS [ 0.292 s]
[INFO] JBoss Fuse Tooling :: Camel Editor ................. SUCCESS [ 0.014 s]
[INFO] JBoss Fuse Tooling :: Camel Editor :: Plugins ...... SUCCESS [ 0.012 s]
[INFO] JBoss Fuse Tooling :: Camel Editor :: Plugins :: Branding SUCCESS [ 0.551 s]
[INFO] JBoss Fuse Tooling :: Core :: Plugins :: Camel Validation SUCCESS [ 0.362 s]
[INFO] JBoss Fuse Tooling :: Core :: Plugins :: Cheat Sheets SUCCESS [ 0.091 s]
[INFO] JBoss Fuse Tooling :: Core :: Plugins :: Graph ..... SUCCESS [ 0.302 s]
[INFO] JBoss Fuse Tooling :: Core :: Plugins :: Help ...... SUCCESS [ 3.848 s]
[INFO] JBoss Fuse Tooling :: Core :: Plugins :: Imports ... SUCCESS [ 0.296 s]
[INFO] JBoss Fuse Tooling :: Core :: Plugins :: Branding .. SUCCESS [ 0.097 s]
[INFO] JBoss Fuse Tooling :: Core :: Tests ................ SUCCESS [ 0.010 s]
[INFO] JBoss Fuse Tooling :: Core :: Tests :: Camel Service Core Tests SUCCESS [ 2.769 s]
[INFO] JBoss Fuse Tooling :: JMX .......................... SUCCESS [ 0.012 s]
[INFO] JBoss Fuse Tooling :: JMX :: Plugins ............... SUCCESS [ 0.010 s]
[INFO] JBoss Fuse Tooling :: JMX :: Plugins :: JMX Commons SUCCESS [ 0.393 s]
[INFO] JBoss Fuse Tooling :: Camel Editor :: Plugins :: Launcher SUCCESS [ 0.443 s]
[INFO] JBoss Fuse Tooling :: Camel Editor :: Plugins :: Camel Editor SUCCESS [ 1.033 s]
[INFO] JBoss Fuse Tooling :: Core :: Tests :: Camel Service Core Integration Tests SUCCESS [01:05 min]
[INFO] JBoss Fuse Tooling :: Core :: Tests :: Camel Model Tests SUCCESS [ 8.232 s]
[INFO] JBoss Fuse Tooling :: Core :: Tests :: Camel Validation Integration Tests SUCCESS [ 0.523 s]
[INFO] JBoss Fuse Tooling :: Core :: Tests :: Camel Validation Tests SUCCESS [ 1.705 s]
[INFO] JBoss Fuse Tooling :: Camel Editor :: Plugins :: Project SUCCESS [ 0.477 s]
[INFO] JBoss Fuse Tooling :: Camel Editor :: Plugins :: Project Templates SUCCESS [ 3.406 s]
[INFO] JBoss Fuse Tooling :: Camel Editor :: Tests ........ SUCCESS [ 0.011 s]
[INFO] JBoss Fuse Tooling :: Camel Editor :: Tests :: Camel Editor Integration Tests SUCCESS [05:39 min]
[INFO] JBoss Fuse Tooling :: Core :: Tests :: Camel Validation Integration Tests SUCCESS [ 15.336 s]
[INFO] JBoss Fuse Tooling :: Core :: Features ............. SUCCESS [ 0.010 s]
[INFO] JBoss Fuse Tooling :: Core :: Features :: Core Feature SUCCESS [ 0.292 s]
[INFO] JBoss Fuse Tooling :: Camel Editor :: Plugins :: XSD Catalogs SUCCESS [ 0.155 s]
[INFO] JBoss Fuse Tooling :: Camel Editor :: Plugins :: Launcher UI SUCCESS [ 0.353 s]
[INFO] JBoss Fuse Tooling :: Camel Editor :: Tests :: Camel Editor Tests SUCCESS [ 3.774 s]
[INFO] JBoss Fuse Tooling :: Camel Editor :: Tests :: Camel IDE Launcher Tests SUCCESS [ 1.917 s]
[INFO] JBoss Fuse Tooling :: Camel Editor :: Tests :: Launcher UI Tests SUCCESS [ 1.982 s]
[INFO] JBoss Fuse Tooling :: Camel Editor :: Tests :: Camel IDE Launcher UI Integration Tests SUCCESS [ 8.960 s]
[INFO] JBoss Fuse Tooling :: Camel Editor :: Tests :: Camel IDE Project Integration Tests SUCCESS [ 9.441 s]
[INFO] JBoss Fuse Tooling :: Camel Editor :: Tests :: Project Templates Tests SUCCESS [ 1.904 s]
[INFO] JBoss Fuse Tooling :: Camel Editor :: Tests :: Project Templates Integration Tests FAILURE [18:18 min]
[INFO] JBoss Fuse Tooling :: Camel Editor :: Features ..... SUCCESS [ 0.012 s]
[INFO] JBoss Fuse Tooling :: Camel Editor :: Features :: Camel Editor Feature SUCCESS [ 0.240 s]
[INFO] JBoss Fuse Tooling :: Data Transformation .......... SUCCESS [ 0.009 s]
[INFO] JBoss Fuse Tooling :: Data Transformation :: Plugins SUCCESS [ 0.009 s]
[INFO] JBoss Fuse Tooling :: Data Transformation :: Plugins :: Core SUCCESS [ 2.226 s]
[INFO] JBoss Fuse Tooling :: Data Transformation :: Plugins :: Editor SUCCESS [ 0.796 s]
[INFO] JBoss Fuse Tooling :: Data Transformation :: Features SUCCESS [ 0.010 s]
[INFO] JBoss Fuse Tooling :: Data Transformation :: Features :: Data Transformation Feature SUCCESS [ 0.219 s]
[INFO] JBoss Fuse Tooling :: Core Transformation :: Tests . SUCCESS [ 0.009 s]
[INFO] JBoss Fuse Tooling :: Core Transformation :: Tests :: Core Transformation Tests SUCCESS [ 2.982 s]
[INFO] JBoss Fuse Tooling :: Core Transformation :: Tests :: Core Transformation Integration Tests SUCCESS [ 9.499 s]
[INFO] JBoss Fuse Tooling :: Editor Transformation :: Tests :: Editor Transformation Tests SUCCESS [ 1.681 s]
[INFO] JBoss Fuse Tooling :: Transformation Editor :: Tests :: Transformation Editor Integration Tests SUCCESS [ 10.452 s]
[INFO] JBoss Fuse Tooling :: JMX :: Plugins :: Apache ActiveMQ Facade SUCCESS [ 5.101 s]
[INFO] JBoss Fuse Tooling :: JMX :: Plugins :: Apache Camel Facade SUCCESS [ 0.437 s]
[INFO] JBoss Fuse Tooling :: JMX :: Plugins :: JMX Diagram View SUCCESS [ 0.365 s]
[INFO] JBoss Fuse Tooling :: Server Adapters .............. SUCCESS [ 0.009 s]
[INFO] JBoss Fuse Tooling :: Server Adapters :: Plugins ... SUCCESS [ 0.008 s]
[INFO] JBoss Fuse Tooling :: Server Adapters :: Plugins :: Apache Karaf Adapter Core SUCCESS [ 0.454 s]
[INFO] JBoss Fuse Tooling :: JMX :: Plugins :: Apache Karaf Facade SUCCESS [ 0.406 s]
[INFO] JBoss Fuse Tooling :: JMX :: Tests ................. SUCCESS [ 0.010 s]
[INFO] JBoss Fuse Tooling :: JMX :: Tests ::Camel ......... SUCCESS [ 1.485 s]
[INFO] JBoss Fuse Tooling :: JMX :: Integration Tests :: Camel SUCCESS [ 7.084 s]
[INFO] JBoss Fuse Tooling :: JMX :: Tests :: Commons ...... SUCCESS [ 1.680 s]
[INFO] JBoss Fuse Tooling :: JMX :: Tests :: Diagram ::View SUCCESS [ 2.418 s]
[INFO] JBoss Fuse Tooling :: JMX :: Features .............. SUCCESS [ 0.010 s]
[INFO] JBoss Fuse Tooling :: Server Adapters :: Plugins :: Commons SUCCESS [ 0.287 s]
[INFO] JBoss Fuse Tooling :: Server Adapters :: Plugins :: Apache Karaf Adapter UI SUCCESS [ 0.430 s]
[INFO] JBoss Fuse Tooling :: Server Adapters :: Plugins :: JBoss Fuse Adapter Core SUCCESS [ 0.342 s]
[INFO] JBoss Fuse Tooling :: Server Adapters :: Plugins :: JBoss Fuse Adapter UI SUCCESS [ 0.372 s]
[INFO] JBoss Fuse Tooling :: Server Adapters :: Features .. SUCCESS [ 0.010 s]
[INFO] JBoss Fuse Tooling :: Server Adapters :: Features :: Server Adapters Feature SUCCESS [ 0.224 s]
[INFO] JBoss Fuse Tooling :: JMX :: Features :: JMX Feature SUCCESS [ 0.269 s]
[INFO] JBoss Fuse Tooling :: Server Adapters :: Tests ..... SUCCESS [ 0.009 s]
[INFO] JBoss Fuse Tooling :: Server Adapters :: Tests :: Karaf Core Tests SUCCESS [ 1.706 s]
[INFO] JBoss Fuse Tooling :: Server Adapters :: Tests :: Server Tests SUCCESS [ 9.734 s]
[INFO] JBoss Fuse Tooling :: Update Site .................. SUCCESS [ 9.550 s]
[INFO] ------------------------------------------------------------------------
[INFO] BUILD FAILURE
[INFO] ------------------------------------------------------------------------
[INFO] Total time: 38:17 min
[INFO] Finished at: 2017-03-24T13:19:36-04:00
[INFO] Final Memory: 314M/766M
[INFO] ------------------------------------------------------------------------
[ERROR] Failed to execute goal org.eclipse.tycho:tycho-surefire-plugin:0.26.0:test (default-test) on project org.fusesource.ide.projecttemplates.tests.integration: There are test failures.
[ERROR]
[ERROR] Please refer to <https://fusesource-jenkins-rhel7.rhev-ci-vms.eng.rdu2.redhat.com/job/Fuse...> for the individual test results.
[ERROR] -> [Help 1]
[ERROR]
[ERROR] To see the full stack trace of the errors, re-run Maven with the -e switch.
[ERROR] Re-run Maven using the -X switch to enable full debug logging.
[ERROR]
[ERROR] For more information about the errors and possible solutions, please read the following articles:
[ERROR] [Help 1] http://cwiki.apache.org/confluence/display/MAVEN/MojoFailureException
[ERROR]
[ERROR] After correcting the problems, you can resume the build with the command
[ERROR] mvn <goals> -rf :org.fusesource.ide.projecttemplates.tests.integration
Build step 'Invoke top-level Maven targets' marked build as failure
Terminating xvnc.
$ vncserver -kill :22
Killing Xvnc process ID 11961
Archiving artifacts
Recording test results
7 years, 11 months
Build failed in Jenkins: Fuse-Tooling-9.2.x-Update-Site #86
by Fuse Infra Team
See <https://fusesource-jenkins-rhel7.rhev-ci-vms.eng.rdu2.redhat.com/job/Fuse...>
Changes:
[Aurelien Pupier] Remove useless assignments to local variable
------------------------------------------
[...truncated 12769 lines...]
[INFO] tycho.testArgLine set to -javaagent:<https://fusesource-jenkins-rhel7.rhev-ci-vms.eng.rdu2.redhat.com/job/Fuse...>:org.jboss.tools.fuse.*
[INFO]
[INFO] --- tycho-surefire-plugin:0.26.0:test (default-test) @ org.fusesource.ide.server.tests ---
[INFO] Expected eclipse log file: <https://fusesource-jenkins-rhel7.rhev-ci-vms.eng.rdu2.redhat.com/job/Fuse...> sp(a)xn--c/-bja.metadata/.log
[INFO] Command line:
[/usr/lib/jvm/java-1.8.0-openjdk-1.8.0.121-0.b13.el7_3.x86_64/jre/bin/java, -Dosgi.noShutdown=false, -Dosgi.os=linux, -Dosgi.ws=gtk, -Dosgi.arch=x86_64, -javaagent:<https://fusesource-jenkins-rhel7.rhev-ci-vms.eng.rdu2.redhat.com/job/Fuse...>:org.jboss.tools.fuse.*, -XX:+HeapDumpOnOutOfMemoryError, -Dusage_reporting_enabled=false, -Dorg.jboss.tools.vpe.loadxulrunner=false, -Dosgi.clean=true, -jar, <https://fusesource-jenkins-rhel7.rhev-ci-vms.eng.rdu2.redhat.com/job/Fuse...,> -data, <https://fusesource-jenkins-rhel7.rhev-ci-vms.eng.rdu2.redhat.com/job/Fuse...> sp@cé, -install, <https://fusesource-jenkins-rhel7.rhev-ci-vms.eng.rdu2.redhat.com/job/Fuse...,> -configuration, <https://fusesource-jenkins-rhel7.rhev-ci-vms.eng.rdu2.redhat.com/job/Fuse...,> -application, org.eclipse.tycho.surefire.osgibooter.uitest, -testproperties, <https://fusesource-jenkins-rhel7.rhev-ci-vms.eng.rdu2.redhat.com/job/Fuse...]>
-------------------------------------------------------
T E S T S
-------------------------------------------------------
Running org.fusesource.ide.server.tests.bean.FuseESBServerBean6xIT
Tests run: 2, Failures: 0, Errors: 0, Skipped: 0, Time elapsed: 0.063 sec - in org.fusesource.ide.server.tests.bean.FuseESBServerBean6xIT
testFuseESB[0](org.fusesource.ide.server.tests.bean.FuseESBServerBean6xIT) Time elapsed: 0.029 sec
testFuseESB[1](org.fusesource.ide.server.tests.bean.FuseESBServerBean6xIT) Time elapsed: 0.001 sec
Running org.fusesource.ide.server.tests.bean.KarafServerBean3xIT
Tests run: 1, Failures: 0, Errors: 0, Skipped: 0, Time elapsed: 0.008 sec - in org.fusesource.ide.server.tests.bean.KarafServerBean3xIT
testKaraf[0](org.fusesource.ide.server.tests.bean.KarafServerBean3xIT) Time elapsed: 0.004 sec
Running org.fusesource.ide.server.tests.bean.KarafServerBean2xIT
Tests run: 2, Failures: 0, Errors: 0, Skipped: 0, Time elapsed: 0.006 sec - in org.fusesource.ide.server.tests.bean.KarafServerBean2xIT
testKaraf[0](org.fusesource.ide.server.tests.bean.KarafServerBean2xIT) Time elapsed: 0.002 sec
testKaraf[1](org.fusesource.ide.server.tests.bean.KarafServerBean2xIT) Time elapsed: 0.002 sec
Running org.fusesource.ide.server.tests.locator.KarafRuntime2xLocatorIT
Tests run: 2, Failures: 0, Errors: 0, Skipped: 0, Time elapsed: 0.032 sec - in org.fusesource.ide.server.tests.locator.KarafRuntime2xLocatorIT
testKaraf[0](org.fusesource.ide.server.tests.locator.KarafRuntime2xLocatorIT) Time elapsed: 0.025 sec
testKaraf[1](org.fusesource.ide.server.tests.locator.KarafRuntime2xLocatorIT) Time elapsed: 0.004 sec
Running org.fusesource.ide.server.tests.locator.FuseESBRuntime6xLocatorIT
Tests run: 2, Failures: 0, Errors: 0, Skipped: 0, Time elapsed: 0.014 sec - in org.fusesource.ide.server.tests.locator.FuseESBRuntime6xLocatorIT
testFuseESB[0](org.fusesource.ide.server.tests.locator.FuseESBRuntime6xLocatorIT) Time elapsed: 0.008 sec
testFuseESB[1](org.fusesource.ide.server.tests.locator.FuseESBRuntime6xLocatorIT) Time elapsed: 0.004 sec
Running org.fusesource.ide.server.tests.locator.KarafRuntime3xLocatorIT
Tests run: 1, Failures: 0, Errors: 0, Skipped: 0, Time elapsed: 0.011 sec - in org.fusesource.ide.server.tests.locator.KarafRuntime3xLocatorIT
testKaraf[0](org.fusesource.ide.server.tests.locator.KarafRuntime3xLocatorIT) Time elapsed: 0.01 sec
Results :
Tests run: 10, Failures: 0, Errors: 0, Skipped: 0
[INFO] All tests passed!
[INFO]
[INFO] --- jacoco-maven-plugin:0.7.9:report (jacoco-site) @ org.fusesource.ide.server.tests ---
[INFO] Skipping JaCoCo execution due to missing execution data file.
[INFO]
[INFO] --- tycho-p2-extras-plugin:0.26.0:compare-version-with-baselines (default) @ org.fusesource.ide.server.tests ---
[INFO]
[INFO] --- maven-install-plugin:2.3.1:install (default-install) @ org.fusesource.ide.server.tests ---
[INFO] Installing <https://fusesource-jenkins-rhel7.rhev-ci-vms.eng.rdu2.redhat.com/job/Fuse...> to <https://fusesource-jenkins-rhel7.rhev-ci-vms.eng.rdu2.redhat.com/job/Fuse...>
[INFO] Installing <https://fusesource-jenkins-rhel7.rhev-ci-vms.eng.rdu2.redhat.com/job/Fuse...> to <https://fusesource-jenkins-rhel7.rhev-ci-vms.eng.rdu2.redhat.com/job/Fuse...>
[INFO] Installing <https://fusesource-jenkins-rhel7.rhev-ci-vms.eng.rdu2.redhat.com/job/Fuse...> to <https://fusesource-jenkins-rhel7.rhev-ci-vms.eng.rdu2.redhat.com/job/Fuse...>
[INFO] Installing <https://fusesource-jenkins-rhel7.rhev-ci-vms.eng.rdu2.redhat.com/job/Fuse...> to <https://fusesource-jenkins-rhel7.rhev-ci-vms.eng.rdu2.redhat.com/job/Fuse...>
[INFO] Installing <https://fusesource-jenkins-rhel7.rhev-ci-vms.eng.rdu2.redhat.com/job/Fuse...> to <https://fusesource-jenkins-rhel7.rhev-ci-vms.eng.rdu2.redhat.com/job/Fuse...>
[INFO] Installing <https://fusesource-jenkins-rhel7.rhev-ci-vms.eng.rdu2.redhat.com/job/Fuse...> to <https://fusesource-jenkins-rhel7.rhev-ci-vms.eng.rdu2.redhat.com/job/Fuse...>
[INFO] Installing <https://fusesource-jenkins-rhel7.rhev-ci-vms.eng.rdu2.redhat.com/job/Fuse...> to <https://fusesource-jenkins-rhel7.rhev-ci-vms.eng.rdu2.redhat.com/job/Fuse...>
[INFO]
[INFO] --- tycho-p2-plugin:0.26.0:update-local-index (default-update-local-index) @ org.fusesource.ide.server.tests ---
[INFO]
[INFO] ------------------------------------------------------------------------
[INFO] Building JBoss Fuse Tooling :: Update Site 9.2.0-SNAPSHOT
[INFO] ------------------------------------------------------------------------
[INFO]
[INFO] --- maven-clean-plugin:3.0.0:clean (default-clean) @ org.fusesource.ide.updatesite ---
[INFO]
[INFO] --- tycho-packaging-plugin:0.26.0:build-qualifier-aggregator (default-build-qualifier-aggregator) @ org.fusesource.ide.updatesite ---
[INFO] The project's OSGi version is 9.2.0.CI-v20170324-1500-B86
[INFO]
[INFO] --- build-helper-maven-plugin:1.7:regex-property (regex-property) @ org.fusesource.ide.updatesite ---
[INFO] Setting property 'skipTestsOrITests' to ''.
[INFO]
[INFO] --- maven-enforcer-plugin:1.4.1:enforce (core-has-ui-deps) @ org.fusesource.ide.updatesite ---
[INFO]
[INFO] --- maven-enforcer-plugin:1.4.1:enforce (warn-no-snapshots-AMx) @ org.fusesource.ide.updatesite ---
[ERROR] Found property update.site.version = 9.2.0-SNAPSHOT.CI
[INFO]
[INFO] --- maven-enforcer-plugin:1.4.1:enforce (enforce-no-snapshots-Final) @ org.fusesource.ide.updatesite ---
[ERROR] Found property update.site.version = 9.2.0-SNAPSHOT.CI
[INFO]
[INFO] --- maven-clean-plugin:3.0.0:clean (default-clean-1) @ org.fusesource.ide.updatesite ---
[INFO]
[INFO] --- jacoco-maven-plugin:0.7.9:prepare-agent (default) @ org.fusesource.ide.updatesite ---
[INFO] argLine set to -javaagent:<https://fusesource-jenkins-rhel7.rhev-ci-vms.eng.rdu2.redhat.com/job/Fuse...>
[INFO]
[INFO] --- jacoco-maven-plugin:0.7.9:prepare-agent (agent-for-ut) @ org.fusesource.ide.updatesite ---
[INFO] argLine set to -javaagent:<https://fusesource-jenkins-rhel7.rhev-ci-vms.eng.rdu2.redhat.com/job/Fuse...>:org.jboss.tools.fuse.*
[INFO]
[INFO] --- maven-resources-plugin:2.7:resources (default-resources) @ org.fusesource.ide.updatesite ---
[INFO] Using 'UTF-8' encoding to copy filtered resources.
[INFO] skip non existing resourceDirectory <https://fusesource-jenkins-rhel7.rhev-ci-vms.eng.rdu2.redhat.com/job/Fuse...>
[INFO]
[INFO] --- maven-compiler-plugin:3.5.1:testCompile (compiletests) @ org.fusesource.ide.updatesite ---
[INFO] No sources to compile
[INFO]
[INFO] --- maven-surefire-plugin:2.19.1:test (test) @ org.fusesource.ide.updatesite ---
[INFO] No tests to run.
[INFO]
[INFO] --- tycho-source-plugin:0.26.0:plugin-source (plugin-source) @ org.fusesource.ide.updatesite ---
[INFO]
[INFO] --- target-platform-configuration:0.26.0:target-platform (default-target-platform) @ org.fusesource.ide.updatesite ---
[INFO]
[INFO] --- tycho-p2-publisher-plugin:0.26.0:publish-products (default-publish-products) @ org.fusesource.ide.updatesite ---
[INFO]
[INFO] --- tycho-p2-publisher-plugin:0.26.0:publish-categories (default-publish-categories) @ org.fusesource.ide.updatesite ---
[INFO]
[INFO] --- tycho-p2-publisher-plugin:0.26.0:attach-artifacts (default-attach-artifacts) @ org.fusesource.ide.updatesite ---
[INFO]
[INFO] --- tycho-p2-repository-plugin:0.26.0:assemble-repository (default-assemble-repository) @ org.fusesource.ide.updatesite ---
[INFO]
[INFO] --- tycho-p2-repository-plugin:0.26.0:archive-repository (default-archive-repository) @ org.fusesource.ide.updatesite ---
[INFO] Building zip: <https://fusesource-jenkins-rhel7.rhev-ci-vms.eng.rdu2.redhat.com/job/Fuse...>
[INFO]
[INFO] --- tycho-source-feature-plugin:0.26.0:source-feature (source-feature) @ org.fusesource.ide.updatesite ---
[INFO]
[INFO] --- tycho-p2-plugin:0.26.0:p2-metadata (attached-p2-metadata) @ org.fusesource.ide.updatesite ---
[INFO]
[INFO] --- repository-utils:0.26.0:generate-repository-facade (generate-facade) @ org.fusesource.ide.updatesite ---
[INFO] Building zip: <https://fusesource-jenkins-rhel7.rhev-ci-vms.eng.rdu2.redhat.com/job/Fuse...>
[INFO]
[INFO] --- jacoco-maven-plugin:0.7.9:prepare-agent-integration (agent-for-it) @ org.fusesource.ide.updatesite ---
[INFO] argLine set to -javaagent:<https://fusesource-jenkins-rhel7.rhev-ci-vms.eng.rdu2.redhat.com/job/Fuse...>:org.jboss.tools.fuse.*
[INFO]
[INFO] --- jacoco-maven-plugin:0.7.9:report (jacoco-site) @ org.fusesource.ide.updatesite ---
[INFO] Skipping JaCoCo execution due to missing execution data file.
[INFO]
[INFO] --- tycho-p2-extras-plugin:0.26.0:compare-version-with-baselines (default) @ org.fusesource.ide.updatesite ---
[INFO]
[INFO] --- maven-install-plugin:2.3.1:install (default-install) @ org.fusesource.ide.updatesite ---
[INFO] Installing <https://fusesource-jenkins-rhel7.rhev-ci-vms.eng.rdu2.redhat.com/job/Fuse...> to <https://fusesource-jenkins-rhel7.rhev-ci-vms.eng.rdu2.redhat.com/job/Fuse...>
[INFO] Installing <https://fusesource-jenkins-rhel7.rhev-ci-vms.eng.rdu2.redhat.com/job/Fuse...> to <https://fusesource-jenkins-rhel7.rhev-ci-vms.eng.rdu2.redhat.com/job/Fuse...>
[INFO] Installing <https://fusesource-jenkins-rhel7.rhev-ci-vms.eng.rdu2.redhat.com/job/Fuse...> to <https://fusesource-jenkins-rhel7.rhev-ci-vms.eng.rdu2.redhat.com/job/Fuse...>
[INFO] Installing <https://fusesource-jenkins-rhel7.rhev-ci-vms.eng.rdu2.redhat.com/job/Fuse...> to <https://fusesource-jenkins-rhel7.rhev-ci-vms.eng.rdu2.redhat.com/job/Fuse...>
[INFO]
[INFO] --- tycho-p2-plugin:0.26.0:update-local-index (default-update-local-index) @ org.fusesource.ide.updatesite ---
[INFO] ------------------------------------------------------------------------
[INFO] Reactor Summary:
[INFO]
[INFO] JBoss Fuse Tooling :: Build Configuration .......... SUCCESS [ 11.246 s]
[INFO] JBoss Fuse Tooling ................................. SUCCESS [ 23.237 s]
[INFO] JBoss Fuse Tooling :: Tools ........................ SUCCESS [ 0.015 s]
[INFO] JBoss Fuse Tooling :: Tools :: IDE Camel Catalog Generator SUCCESS [01:43 min]
[INFO] JBoss Fuse Tooling :: Core ......................... SUCCESS [ 0.018 s]
[INFO] JBoss Fuse Tooling :: Core :: Plugins .............. SUCCESS [ 0.013 s]
[INFO] JBoss Fuse Tooling :: Core :: Plugins :: Foundation Core SUCCESS [ 10.759 s]
[INFO] JBoss Fuse Tooling :: Core :: Plugins :: Preferences SUCCESS [ 0.208 s]
[INFO] JBoss Fuse Tooling :: Core :: Plugins :: Foundation UI SUCCESS [ 1.178 s]
[INFO] JBoss Fuse Tooling :: Core :: Plugins :: Camel Model Service API SUCCESS [ 9.651 s]
[INFO] JBoss Fuse Tooling :: Core :: Plugins :: Camel 2.15.1.redhat-621084 Service Implementation SUCCESS [ 2.356 s]
[INFO] JBoss Fuse Tooling :: Core :: Plugins :: Camel 2.15.1.redhat-621117 Service Implementation SUCCESS [ 1.966 s]
[INFO] JBoss Fuse Tooling :: Core :: Plugins :: Camel 2.17.0.redhat-630187 Service Implementation SUCCESS [ 19.233 s]
[INFO] JBoss Fuse Tooling :: Core :: Plugins :: Camel 2.17.0.redhat-630224 Service Implementation SUCCESS [ 16.694 s]
[INFO] JBoss Fuse Tooling :: Core :: Plugins :: Camel 2.17.3 Service Implementation SUCCESS [ 6.234 s]
[INFO] JBoss Fuse Tooling :: Core :: Plugins :: Camel 2.18.1.redhat-000012 Service Implementation SUCCESS [ 15.387 s]
[INFO] JBoss Fuse Tooling :: Core :: Plugins :: Maven ..... SUCCESS [ 0.286 s]
[INFO] JBoss Fuse Tooling :: Camel Editor ................. SUCCESS [ 0.014 s]
[INFO] JBoss Fuse Tooling :: Camel Editor :: Plugins ...... SUCCESS [ 0.011 s]
[INFO] JBoss Fuse Tooling :: Camel Editor :: Plugins :: Branding SUCCESS [ 0.562 s]
[INFO] JBoss Fuse Tooling :: Core :: Plugins :: Camel Validation SUCCESS [ 0.409 s]
[INFO] JBoss Fuse Tooling :: Core :: Plugins :: Cheat Sheets SUCCESS [ 0.115 s]
[INFO] JBoss Fuse Tooling :: Core :: Plugins :: Graph ..... SUCCESS [ 0.315 s]
[INFO] JBoss Fuse Tooling :: Core :: Plugins :: Help ...... SUCCESS [ 4.226 s]
[INFO] JBoss Fuse Tooling :: Core :: Plugins :: Imports ... SUCCESS [ 0.288 s]
[INFO] JBoss Fuse Tooling :: Core :: Plugins :: Branding .. SUCCESS [ 0.106 s]
[INFO] JBoss Fuse Tooling :: Core :: Tests ................ SUCCESS [ 0.011 s]
[INFO] JBoss Fuse Tooling :: Core :: Tests :: Camel Service Core Tests SUCCESS [ 2.785 s]
[INFO] JBoss Fuse Tooling :: JMX .......................... SUCCESS [ 0.012 s]
[INFO] JBoss Fuse Tooling :: JMX :: Plugins ............... SUCCESS [ 0.009 s]
[INFO] JBoss Fuse Tooling :: JMX :: Plugins :: JMX Commons SUCCESS [ 0.447 s]
[INFO] JBoss Fuse Tooling :: Camel Editor :: Plugins :: Launcher SUCCESS [ 0.450 s]
[INFO] JBoss Fuse Tooling :: Camel Editor :: Plugins :: Camel Editor SUCCESS [ 1.028 s]
[INFO] JBoss Fuse Tooling :: Core :: Tests :: Camel Service Core Integration Tests SUCCESS [ 39.038 s]
[INFO] JBoss Fuse Tooling :: Core :: Tests :: Camel Model Tests SUCCESS [ 8.617 s]
[INFO] JBoss Fuse Tooling :: Core :: Tests :: Camel Validation Integration Tests SUCCESS [ 0.561 s]
[INFO] JBoss Fuse Tooling :: Core :: Tests :: Camel Validation Tests SUCCESS [ 1.841 s]
[INFO] JBoss Fuse Tooling :: Camel Editor :: Plugins :: Project SUCCESS [ 0.474 s]
[INFO] JBoss Fuse Tooling :: Camel Editor :: Plugins :: Project Templates SUCCESS [ 3.467 s]
[INFO] JBoss Fuse Tooling :: Camel Editor :: Tests ........ SUCCESS [ 0.011 s]
[INFO] JBoss Fuse Tooling :: Camel Editor :: Tests :: Camel Editor Integration Tests SUCCESS [05:43 min]
[INFO] JBoss Fuse Tooling :: Core :: Tests :: Camel Validation Integration Tests FAILURE [ 14.031 s]
[INFO] JBoss Fuse Tooling :: Core :: Features ............. SUCCESS [ 0.011 s]
[INFO] JBoss Fuse Tooling :: Core :: Features :: Core Feature SUCCESS [ 0.364 s]
[INFO] JBoss Fuse Tooling :: Camel Editor :: Plugins :: XSD Catalogs SUCCESS [ 0.147 s]
[INFO] JBoss Fuse Tooling :: Camel Editor :: Plugins :: Launcher UI SUCCESS [ 0.426 s]
[INFO] JBoss Fuse Tooling :: Camel Editor :: Tests :: Camel Editor Tests SUCCESS [ 3.916 s]
[INFO] JBoss Fuse Tooling :: Camel Editor :: Tests :: Camel IDE Launcher Tests SUCCESS [ 1.995 s]
[INFO] JBoss Fuse Tooling :: Camel Editor :: Tests :: Launcher UI Tests SUCCESS [ 2.461 s]
[INFO] JBoss Fuse Tooling :: Camel Editor :: Tests :: Camel IDE Launcher UI Integration Tests SUCCESS [ 9.430 s]
[INFO] JBoss Fuse Tooling :: Camel Editor :: Tests :: Camel IDE Project Integration Tests SUCCESS [ 10.011 s]
[INFO] JBoss Fuse Tooling :: Camel Editor :: Tests :: Project Templates Tests SUCCESS [ 1.982 s]
[INFO] JBoss Fuse Tooling :: Camel Editor :: Tests :: Project Templates Integration Tests SUCCESS [18:48 min]
[INFO] JBoss Fuse Tooling :: Camel Editor :: Features ..... SUCCESS [ 0.012 s]
[INFO] JBoss Fuse Tooling :: Camel Editor :: Features :: Camel Editor Feature SUCCESS [ 0.247 s]
[INFO] JBoss Fuse Tooling :: Data Transformation .......... SUCCESS [ 0.009 s]
[INFO] JBoss Fuse Tooling :: Data Transformation :: Plugins SUCCESS [ 0.026 s]
[INFO] JBoss Fuse Tooling :: Data Transformation :: Plugins :: Core SUCCESS [ 2.622 s]
[INFO] JBoss Fuse Tooling :: Data Transformation :: Plugins :: Editor SUCCESS [ 0.826 s]
[INFO] JBoss Fuse Tooling :: Data Transformation :: Features SUCCESS [ 0.011 s]
[INFO] JBoss Fuse Tooling :: Data Transformation :: Features :: Data Transformation Feature SUCCESS [ 0.249 s]
[INFO] JBoss Fuse Tooling :: Core Transformation :: Tests . SUCCESS [ 0.012 s]
[INFO] JBoss Fuse Tooling :: Core Transformation :: Tests :: Core Transformation Tests SUCCESS [ 2.803 s]
[INFO] JBoss Fuse Tooling :: Core Transformation :: Tests :: Core Transformation Integration Tests SUCCESS [ 9.951 s]
[INFO] JBoss Fuse Tooling :: Editor Transformation :: Tests :: Editor Transformation Tests SUCCESS [ 1.707 s]
[INFO] JBoss Fuse Tooling :: Transformation Editor :: Tests :: Transformation Editor Integration Tests SUCCESS [ 11.045 s]
[INFO] JBoss Fuse Tooling :: JMX :: Plugins :: Apache ActiveMQ Facade SUCCESS [ 9.557 s]
[INFO] JBoss Fuse Tooling :: JMX :: Plugins :: Apache Camel Facade SUCCESS [ 0.457 s]
[INFO] JBoss Fuse Tooling :: JMX :: Plugins :: JMX Diagram View SUCCESS [ 0.437 s]
[INFO] JBoss Fuse Tooling :: Server Adapters .............. SUCCESS [ 0.027 s]
[INFO] JBoss Fuse Tooling :: Server Adapters :: Plugins ... SUCCESS [ 0.010 s]
[INFO] JBoss Fuse Tooling :: Server Adapters :: Plugins :: Apache Karaf Adapter Core SUCCESS [ 0.472 s]
[INFO] JBoss Fuse Tooling :: JMX :: Plugins :: Apache Karaf Facade SUCCESS [ 0.445 s]
[INFO] JBoss Fuse Tooling :: JMX :: Tests ................. SUCCESS [ 0.011 s]
[INFO] JBoss Fuse Tooling :: JMX :: Tests ::Camel ......... SUCCESS [ 1.656 s]
[INFO] JBoss Fuse Tooling :: JMX :: Integration Tests :: Camel SUCCESS [ 7.624 s]
[INFO] JBoss Fuse Tooling :: JMX :: Tests :: Commons ...... SUCCESS [ 1.758 s]
[INFO] JBoss Fuse Tooling :: JMX :: Tests :: Diagram ::View SUCCESS [ 1.951 s]
[INFO] JBoss Fuse Tooling :: JMX :: Features .............. SUCCESS [ 0.011 s]
[INFO] JBoss Fuse Tooling :: Server Adapters :: Plugins :: Commons SUCCESS [ 0.246 s]
[INFO] JBoss Fuse Tooling :: Server Adapters :: Plugins :: Apache Karaf Adapter UI SUCCESS [ 0.416 s]
[INFO] JBoss Fuse Tooling :: Server Adapters :: Plugins :: JBoss Fuse Adapter Core SUCCESS [ 0.367 s]
[INFO] JBoss Fuse Tooling :: Server Adapters :: Plugins :: JBoss Fuse Adapter UI SUCCESS [ 0.403 s]
[INFO] JBoss Fuse Tooling :: Server Adapters :: Features .. SUCCESS [ 0.010 s]
[INFO] JBoss Fuse Tooling :: Server Adapters :: Features :: Server Adapters Feature SUCCESS [ 0.236 s]
[INFO] JBoss Fuse Tooling :: JMX :: Features :: JMX Feature SUCCESS [ 0.254 s]
[INFO] JBoss Fuse Tooling :: Server Adapters :: Tests ..... SUCCESS [ 0.010 s]
[INFO] JBoss Fuse Tooling :: Server Adapters :: Tests :: Karaf Core Tests SUCCESS [ 1.809 s]
[INFO] JBoss Fuse Tooling :: Server Adapters :: Tests :: Server Tests SUCCESS [ 10.201 s]
[INFO] JBoss Fuse Tooling :: Update Site .................. SUCCESS [ 9.796 s]
[INFO] ------------------------------------------------------------------------
[INFO] BUILD FAILURE
[INFO] ------------------------------------------------------------------------
[INFO] Total time: 39:11 min
[INFO] Finished at: 2017-03-24T11:40:36-04:00
[INFO] Final Memory: 326M/840M
[INFO] ------------------------------------------------------------------------
[ERROR] Failed to execute goal org.eclipse.tycho:tycho-surefire-plugin:0.26.0:test (default-test) on project org.fusesource.ide.camel.validation.tests.integration: There are test failures.
[ERROR]
[ERROR] Please refer to <https://fusesource-jenkins-rhel7.rhev-ci-vms.eng.rdu2.redhat.com/job/Fuse...> for the individual test results.
[ERROR] -> [Help 1]
[ERROR]
[ERROR] To see the full stack trace of the errors, re-run Maven with the -e switch.
[ERROR] Re-run Maven using the -X switch to enable full debug logging.
[ERROR]
[ERROR] For more information about the errors and possible solutions, please read the following articles:
[ERROR] [Help 1] http://cwiki.apache.org/confluence/display/MAVEN/MojoFailureException
[ERROR]
[ERROR] After correcting the problems, you can resume the build with the command
[ERROR] mvn <goals> -rf :org.fusesource.ide.camel.validation.tests.integration
Build step 'Invoke top-level Maven targets' marked build as failure
Terminating xvnc.
$ vncserver -kill :39
Killing Xvnc process ID 13380
Archiving artifacts
Recording test results
7 years, 11 months
Build failed in Jenkins: Fuse-Tooling-pullrequest #1030
by Fuse Infra Team
See <https://fusesource-jenkins-rhel7.rhev-ci-vms.eng.rdu2.redhat.com/job/Fuse...>
Changes:
[Aurelien Pupier] FUSETOOLS-2336 - Add Hystrix Routing EIP in the Palette
------------------------------------------
[...truncated 49884 lines...]
testKaraf[0](org.fusesource.ide.server.tests.bean.KarafServerBean3xIT) Time elapsed: 0.03 sec
Running org.fusesource.ide.server.tests.bean.FuseESBServerBean6xIT
Tests run: 2, Failures: 0, Errors: 0, Skipped: 0, Time elapsed: 0.007 sec - in org.fusesource.ide.server.tests.bean.FuseESBServerBean6xIT
testFuseESB[0](org.fusesource.ide.server.tests.bean.FuseESBServerBean6xIT) Time elapsed: 0.001 sec
testFuseESB[1](org.fusesource.ide.server.tests.bean.FuseESBServerBean6xIT) Time elapsed: 0.001 sec
Running org.fusesource.ide.server.tests.bean.KarafServerBean2xIT
Tests run: 2, Failures: 0, Errors: 0, Skipped: 0, Time elapsed: 0.005 sec - in org.fusesource.ide.server.tests.bean.KarafServerBean2xIT
testKaraf[0](org.fusesource.ide.server.tests.bean.KarafServerBean2xIT) Time elapsed: 0.002 sec
testKaraf[1](org.fusesource.ide.server.tests.bean.KarafServerBean2xIT) Time elapsed: 0.001 sec
Running org.fusesource.ide.server.tests.locator.KarafRuntime2xLocatorIT
Tests run: 2, Failures: 0, Errors: 0, Skipped: 0, Time elapsed: 0.031 sec - in org.fusesource.ide.server.tests.locator.KarafRuntime2xLocatorIT
testKaraf[0](org.fusesource.ide.server.tests.locator.KarafRuntime2xLocatorIT) Time elapsed: 0.024 sec
testKaraf[1](org.fusesource.ide.server.tests.locator.KarafRuntime2xLocatorIT) Time elapsed: 0.004 sec
Running org.fusesource.ide.server.tests.locator.KarafRuntime3xLocatorIT
Tests run: 1, Failures: 0, Errors: 0, Skipped: 0, Time elapsed: 0.009 sec - in org.fusesource.ide.server.tests.locator.KarafRuntime3xLocatorIT
testKaraf[0](org.fusesource.ide.server.tests.locator.KarafRuntime3xLocatorIT) Time elapsed: 0.007 sec
Running org.fusesource.ide.server.tests.locator.FuseESBRuntime6xLocatorIT
Tests run: 2, Failures: 0, Errors: 0, Skipped: 0, Time elapsed: 0.013 sec - in org.fusesource.ide.server.tests.locator.FuseESBRuntime6xLocatorIT
testFuseESB[0](org.fusesource.ide.server.tests.locator.FuseESBRuntime6xLocatorIT) Time elapsed: 0.007 sec
testFuseESB[1](org.fusesource.ide.server.tests.locator.FuseESBRuntime6xLocatorIT) Time elapsed: 0.004 sec
Results :
Tests run: 10, Failures: 0, Errors: 0, Skipped: 0
[INFO] All tests passed!
[INFO]
[INFO] --- jacoco-maven-plugin:0.7.9:report (jacoco-site) @ org.fusesource.ide.server.tests ---
[INFO] Skipping JaCoCo execution due to missing execution data file.
[INFO]
[INFO] --- tycho-p2-extras-plugin:0.26.0:compare-version-with-baselines (default) @ org.fusesource.ide.server.tests ---
[INFO]
[INFO] ------------------------------------------------------------------------
[INFO] Building JBoss Fuse Tooling :: Update Site 9.2.0-SNAPSHOT
[INFO] ------------------------------------------------------------------------
[INFO]
[INFO] --- maven-clean-plugin:3.0.0:clean (default-clean) @ org.fusesource.ide.updatesite ---
[INFO]
[INFO] --- tycho-packaging-plugin:0.26.0:build-qualifier-aggregator (default-build-qualifier-aggregator) @ org.fusesource.ide.updatesite ---
[INFO] The project's OSGi version is 9.2.0.v20170322-1302
[INFO]
[INFO] --- build-helper-maven-plugin:1.7:regex-property (regex-property) @ org.fusesource.ide.updatesite ---
[INFO] Setting property 'skipTestsOrITests' to ''.
[INFO]
[INFO] --- maven-enforcer-plugin:1.4.1:enforce (core-has-ui-deps) @ org.fusesource.ide.updatesite ---
[INFO]
[INFO] --- maven-enforcer-plugin:1.4.1:enforce (warn-no-snapshots-AMx) @ org.fusesource.ide.updatesite ---
[ERROR] Found property update.site.version = 9.2.0-SNAPSHOT.LOCAL
[INFO]
[INFO] --- maven-enforcer-plugin:1.4.1:enforce (enforce-no-snapshots-Final) @ org.fusesource.ide.updatesite ---
[ERROR] Found property update.site.version = 9.2.0-SNAPSHOT.LOCAL
[INFO]
[INFO] --- maven-clean-plugin:3.0.0:clean (default-clean-1) @ org.fusesource.ide.updatesite ---
[INFO]
[INFO] --- jacoco-maven-plugin:0.7.9:prepare-agent (default) @ org.fusesource.ide.updatesite ---
[INFO] argLine set to -javaagent:<https://fusesource-jenkins-rhel7.rhev-ci-vms.eng.rdu2.redhat.com/job/Fuse...>
[INFO]
[INFO] --- jacoco-maven-plugin:0.7.9:prepare-agent (agent-for-ut) @ org.fusesource.ide.updatesite ---
[INFO] argLine set to -javaagent:<https://fusesource-jenkins-rhel7.rhev-ci-vms.eng.rdu2.redhat.com/job/Fuse...>:org.jboss.tools.fuse.*
[INFO]
[INFO] --- maven-resources-plugin:2.7:resources (default-resources) @ org.fusesource.ide.updatesite ---
[INFO] Using 'UTF-8' encoding to copy filtered resources.
[INFO] skip non existing resourceDirectory <https://fusesource-jenkins-rhel7.rhev-ci-vms.eng.rdu2.redhat.com/job/Fuse...>
[INFO]
[INFO] --- maven-compiler-plugin:3.5.1:testCompile (compiletests) @ org.fusesource.ide.updatesite ---
[INFO] No sources to compile
[INFO]
[INFO] --- maven-surefire-plugin:2.19.1:test (test) @ org.fusesource.ide.updatesite ---
[INFO] No tests to run.
[INFO]
[INFO] --- tycho-source-plugin:0.26.0:plugin-source (plugin-source) @ org.fusesource.ide.updatesite ---
[INFO]
[INFO] --- target-platform-configuration:0.26.0:target-platform (default-target-platform) @ org.fusesource.ide.updatesite ---
[INFO]
[INFO] --- tycho-p2-publisher-plugin:0.26.0:publish-products (default-publish-products) @ org.fusesource.ide.updatesite ---
[INFO]
[INFO] --- tycho-p2-publisher-plugin:0.26.0:publish-categories (default-publish-categories) @ org.fusesource.ide.updatesite ---
[INFO]
[INFO] --- tycho-p2-publisher-plugin:0.26.0:attach-artifacts (default-attach-artifacts) @ org.fusesource.ide.updatesite ---
[INFO]
[INFO] --- tycho-p2-repository-plugin:0.26.0:assemble-repository (default-assemble-repository) @ org.fusesource.ide.updatesite ---
[INFO]
[INFO] --- tycho-p2-repository-plugin:0.26.0:archive-repository (default-archive-repository) @ org.fusesource.ide.updatesite ---
[INFO] Building zip: <https://fusesource-jenkins-rhel7.rhev-ci-vms.eng.rdu2.redhat.com/job/Fuse...>
[INFO]
[INFO] --- tycho-source-feature-plugin:0.26.0:source-feature (source-feature) @ org.fusesource.ide.updatesite ---
[INFO]
[INFO] --- tycho-p2-plugin:0.26.0:p2-metadata (attached-p2-metadata) @ org.fusesource.ide.updatesite ---
[INFO]
[INFO] --- repository-utils:0.26.0:generate-repository-facade (generate-facade) @ org.fusesource.ide.updatesite ---
[INFO] Building zip: <https://fusesource-jenkins-rhel7.rhev-ci-vms.eng.rdu2.redhat.com/job/Fuse...>
[INFO]
[INFO] --- jacoco-maven-plugin:0.7.9:prepare-agent-integration (agent-for-it) @ org.fusesource.ide.updatesite ---
[INFO] argLine set to -javaagent:<https://fusesource-jenkins-rhel7.rhev-ci-vms.eng.rdu2.redhat.com/job/Fuse...>:org.jboss.tools.fuse.*
[INFO]
[INFO] --- jacoco-maven-plugin:0.7.9:report (jacoco-site) @ org.fusesource.ide.updatesite ---
[INFO] Skipping JaCoCo execution due to missing execution data file.
[INFO]
[INFO] --- tycho-p2-extras-plugin:0.26.0:compare-version-with-baselines (default) @ org.fusesource.ide.updatesite ---
[INFO] ------------------------------------------------------------------------
[INFO] Reactor Summary:
[INFO]
[INFO] JBoss Fuse Tooling :: Build Configuration .......... SUCCESS [ 10.926 s]
[INFO] JBoss Fuse Tooling ................................. SUCCESS [ 22.712 s]
[INFO] JBoss Fuse Tooling :: Tools ........................ SUCCESS [ 0.012 s]
[INFO] JBoss Fuse Tooling :: Tools :: IDE Camel Catalog Generator SUCCESS [01:44 min]
[INFO] JBoss Fuse Tooling :: Core ......................... SUCCESS [ 0.017 s]
[INFO] JBoss Fuse Tooling :: Core :: Plugins .............. SUCCESS [ 0.013 s]
[INFO] JBoss Fuse Tooling :: Core :: Plugins :: Foundation Core SUCCESS [ 10.163 s]
[INFO] JBoss Fuse Tooling :: Core :: Plugins :: Preferences SUCCESS [ 0.200 s]
[INFO] JBoss Fuse Tooling :: Core :: Plugins :: Foundation UI SUCCESS [ 0.924 s]
[INFO] JBoss Fuse Tooling :: Core :: Plugins :: Camel Model Service API SUCCESS [ 8.696 s]
[INFO] JBoss Fuse Tooling :: Core :: Plugins :: Camel 2.15.1.redhat-621084 Service Implementation SUCCESS [ 2.072 s]
[INFO] JBoss Fuse Tooling :: Core :: Plugins :: Camel 2.15.1.redhat-621117 Service Implementation SUCCESS [ 1.889 s]
[INFO] JBoss Fuse Tooling :: Core :: Plugins :: Camel 2.17.0.redhat-630187 Service Implementation SUCCESS [ 20.066 s]
[INFO] JBoss Fuse Tooling :: Core :: Plugins :: Camel 2.17.0.redhat-630224 Service Implementation SUCCESS [ 17.102 s]
[INFO] JBoss Fuse Tooling :: Core :: Plugins :: Camel 2.17.3 Service Implementation SUCCESS [ 4.884 s]
[INFO] JBoss Fuse Tooling :: Core :: Plugins :: Camel 2.18.1.redhat-000012 Service Implementation SUCCESS [ 14.566 s]
[INFO] JBoss Fuse Tooling :: Core :: Plugins :: Maven ..... SUCCESS [ 0.269 s]
[INFO] JBoss Fuse Tooling :: Camel Editor ................. SUCCESS [ 0.010 s]
[INFO] JBoss Fuse Tooling :: Camel Editor :: Plugins ...... SUCCESS [ 0.009 s]
[INFO] JBoss Fuse Tooling :: Camel Editor :: Plugins :: Branding SUCCESS [ 0.498 s]
[INFO] JBoss Fuse Tooling :: Core :: Plugins :: Camel Validation SUCCESS [ 0.349 s]
[INFO] JBoss Fuse Tooling :: Core :: Plugins :: Cheat Sheets SUCCESS [ 0.093 s]
[INFO] JBoss Fuse Tooling :: Core :: Plugins :: Graph ..... SUCCESS [ 0.318 s]
[INFO] JBoss Fuse Tooling :: Core :: Plugins :: Help ...... SUCCESS [ 4.821 s]
[INFO] JBoss Fuse Tooling :: Core :: Plugins :: Imports ... SUCCESS [ 0.282 s]
[INFO] JBoss Fuse Tooling :: Core :: Plugins :: Branding .. SUCCESS [ 0.090 s]
[INFO] JBoss Fuse Tooling :: Core :: Tests ................ SUCCESS [ 0.008 s]
[INFO] JBoss Fuse Tooling :: Core :: Tests :: Camel Service Core Tests SUCCESS [ 3.149 s]
[INFO] JBoss Fuse Tooling :: JMX .......................... SUCCESS [ 0.012 s]
[INFO] JBoss Fuse Tooling :: JMX :: Plugins ............... SUCCESS [ 0.010 s]
[INFO] JBoss Fuse Tooling :: JMX :: Plugins :: JMX Commons SUCCESS [ 0.396 s]
[INFO] JBoss Fuse Tooling :: Camel Editor :: Plugins :: Launcher SUCCESS [ 0.411 s]
[INFO] JBoss Fuse Tooling :: Camel Editor :: Plugins :: Camel Editor SUCCESS [ 1.013 s]
[INFO] JBoss Fuse Tooling :: Core :: Tests :: Camel Service Core Integration Tests SUCCESS [ 36.956 s]
[INFO] JBoss Fuse Tooling :: Core :: Tests :: Camel Model Tests SUCCESS [ 8.156 s]
[INFO] JBoss Fuse Tooling :: Core :: Tests :: Camel Validation Integration Tests SUCCESS [ 0.536 s]
[INFO] JBoss Fuse Tooling :: Core :: Tests :: Camel Validation Tests SUCCESS [ 1.830 s]
[INFO] JBoss Fuse Tooling :: Camel Editor :: Plugins :: Project SUCCESS [ 0.414 s]
[INFO] JBoss Fuse Tooling :: Camel Editor :: Plugins :: Project Templates SUCCESS [ 3.117 s]
[INFO] JBoss Fuse Tooling :: Camel Editor :: Tests ........ SUCCESS [ 0.009 s]
[INFO] JBoss Fuse Tooling :: Camel Editor :: Tests :: Camel Editor Integration Tests SUCCESS [05:39 min]
[INFO] JBoss Fuse Tooling :: Core :: Tests :: Camel Validation Integration Tests SUCCESS [ 15.513 s]
[INFO] JBoss Fuse Tooling :: Core :: Features ............. SUCCESS [ 0.008 s]
[INFO] JBoss Fuse Tooling :: Core :: Features :: Core Feature SUCCESS [ 0.326 s]
[INFO] JBoss Fuse Tooling :: Camel Editor :: Plugins :: XSD Catalogs SUCCESS [ 0.142 s]
[INFO] JBoss Fuse Tooling :: Camel Editor :: Plugins :: Launcher UI SUCCESS [ 0.398 s]
[INFO] JBoss Fuse Tooling :: Camel Editor :: Tests :: Camel Editor Tests SUCCESS [ 3.605 s]
[INFO] JBoss Fuse Tooling :: Camel Editor :: Tests :: Camel IDE Launcher Tests SUCCESS [ 1.836 s]
[INFO] JBoss Fuse Tooling :: Camel Editor :: Tests :: Launcher UI Tests SUCCESS [ 1.939 s]
[INFO] JBoss Fuse Tooling :: Camel Editor :: Tests :: Camel IDE Launcher UI Integration Tests SUCCESS [ 8.953 s]
[INFO] JBoss Fuse Tooling :: Camel Editor :: Tests :: Camel IDE Project Integration Tests SUCCESS [ 9.546 s]
[INFO] JBoss Fuse Tooling :: Camel Editor :: Tests :: Project Templates Tests SUCCESS [ 1.912 s]
[INFO] JBoss Fuse Tooling :: Camel Editor :: Tests :: Project Templates Integration Tests FAILURE [18:19 min]
[INFO] JBoss Fuse Tooling :: Camel Editor :: Features ..... SUCCESS [ 0.009 s]
[INFO] JBoss Fuse Tooling :: Camel Editor :: Features :: Camel Editor Feature SUCCESS [ 0.232 s]
[INFO] JBoss Fuse Tooling :: Data Transformation .......... SUCCESS [ 0.007 s]
[INFO] JBoss Fuse Tooling :: Data Transformation :: Plugins SUCCESS [ 0.007 s]
[INFO] JBoss Fuse Tooling :: Data Transformation :: Plugins :: Core SUCCESS [ 2.248 s]
[INFO] JBoss Fuse Tooling :: Data Transformation :: Plugins :: Editor SUCCESS [ 0.792 s]
[INFO] JBoss Fuse Tooling :: Data Transformation :: Features SUCCESS [ 0.008 s]
[INFO] JBoss Fuse Tooling :: Data Transformation :: Features :: Data Transformation Feature SUCCESS [ 0.216 s]
[INFO] JBoss Fuse Tooling :: Core Transformation :: Tests . SUCCESS [ 0.008 s]
[INFO] JBoss Fuse Tooling :: Core Transformation :: Tests :: Core Transformation Tests SUCCESS [ 2.678 s]
[INFO] JBoss Fuse Tooling :: Core Transformation :: Tests :: Core Transformation Integration Tests SUCCESS [ 9.415 s]
[INFO] JBoss Fuse Tooling :: Editor Transformation :: Tests :: Editor Transformation Tests SUCCESS [ 1.613 s]
[INFO] JBoss Fuse Tooling :: Transformation Editor :: Tests :: Transformation Editor Integration Tests SUCCESS [ 10.372 s]
[INFO] JBoss Fuse Tooling :: JMX :: Plugins :: Apache ActiveMQ Facade SUCCESS [ 7.323 s]
[INFO] JBoss Fuse Tooling :: JMX :: Plugins :: Apache Camel Facade SUCCESS [ 0.428 s]
[INFO] JBoss Fuse Tooling :: JMX :: Plugins :: JMX Diagram View SUCCESS [ 0.359 s]
[INFO] JBoss Fuse Tooling :: Server Adapters .............. SUCCESS [ 0.007 s]
[INFO] JBoss Fuse Tooling :: Server Adapters :: Plugins ... SUCCESS [ 0.007 s]
[INFO] JBoss Fuse Tooling :: Server Adapters :: Plugins :: Apache Karaf Adapter Core SUCCESS [ 0.465 s]
[INFO] JBoss Fuse Tooling :: JMX :: Plugins :: Apache Karaf Facade SUCCESS [ 0.399 s]
[INFO] JBoss Fuse Tooling :: JMX :: Tests ................. SUCCESS [ 0.007 s]
[INFO] JBoss Fuse Tooling :: JMX :: Tests ::Camel ......... SUCCESS [ 1.476 s]
[INFO] JBoss Fuse Tooling :: JMX :: Integration Tests :: Camel SUCCESS [ 7.198 s]
[INFO] JBoss Fuse Tooling :: JMX :: Tests :: Commons ...... SUCCESS [ 1.660 s]
[INFO] JBoss Fuse Tooling :: JMX :: Tests :: Diagram ::View SUCCESS [ 1.914 s]
[INFO] JBoss Fuse Tooling :: JMX :: Features .............. SUCCESS [ 0.008 s]
[INFO] JBoss Fuse Tooling :: Server Adapters :: Plugins :: Commons SUCCESS [ 0.238 s]
[INFO] JBoss Fuse Tooling :: Server Adapters :: Plugins :: Apache Karaf Adapter UI SUCCESS [ 0.398 s]
[INFO] JBoss Fuse Tooling :: Server Adapters :: Plugins :: JBoss Fuse Adapter Core SUCCESS [ 0.319 s]
[INFO] JBoss Fuse Tooling :: Server Adapters :: Plugins :: JBoss Fuse Adapter UI SUCCESS [ 0.422 s]
[INFO] JBoss Fuse Tooling :: Server Adapters :: Features .. SUCCESS [ 0.008 s]
[INFO] JBoss Fuse Tooling :: Server Adapters :: Features :: Server Adapters Feature SUCCESS [ 0.214 s]
[INFO] JBoss Fuse Tooling :: JMX :: Features :: JMX Feature SUCCESS [ 0.242 s]
[INFO] JBoss Fuse Tooling :: Server Adapters :: Tests ..... SUCCESS [ 0.008 s]
[INFO] JBoss Fuse Tooling :: Server Adapters :: Tests :: Karaf Core Tests SUCCESS [ 1.674 s]
[INFO] JBoss Fuse Tooling :: Server Adapters :: Tests :: Server Tests SUCCESS [ 9.818 s]
[INFO] JBoss Fuse Tooling :: Update Site .................. SUCCESS [ 9.558 s]
[INFO] ------------------------------------------------------------------------
[INFO] BUILD FAILURE
[INFO] ------------------------------------------------------------------------
[INFO] Total time: 38:55 min
[INFO] Finished at: 2017-03-22T10:20:58-04:00
[INFO] Final Memory: 382M/1638M
[INFO] ------------------------------------------------------------------------
[ERROR] Failed to execute goal org.eclipse.tycho:tycho-surefire-plugin:0.26.0:test (default-test) on project org.fusesource.ide.projecttemplates.tests.integration: There are test failures.
[ERROR]
[ERROR] Please refer to <https://fusesource-jenkins-rhel7.rhev-ci-vms.eng.rdu2.redhat.com/job/Fuse...> for the individual test results.
[ERROR] -> [Help 1]
org.apache.maven.lifecycle.LifecycleExecutionException: Failed to execute goal org.eclipse.tycho:tycho-surefire-plugin:0.26.0:test (default-test) on project org.fusesource.ide.projecttemplates.tests.integration: There are test failures.
Please refer to <https://fusesource-jenkins-rhel7.rhev-ci-vms.eng.rdu2.redhat.com/job/Fuse...> for the individual test results.
at org.apache.maven.lifecycle.internal.MojoExecutor.execute(MojoExecutor.java:212)
at org.apache.maven.lifecycle.internal.MojoExecutor.execute(MojoExecutor.java:153)
at org.apache.maven.lifecycle.internal.MojoExecutor.execute(MojoExecutor.java:145)
at org.apache.maven.lifecycle.internal.LifecycleModuleBuilder.buildProject(LifecycleModuleBuilder.java:116)
at org.apache.maven.lifecycle.internal.LifecycleModuleBuilder.buildProject(LifecycleModuleBuilder.java:80)
at org.apache.maven.lifecycle.internal.builder.singlethreaded.SingleThreadedBuilder.build(SingleThreadedBuilder.java:51)
at org.apache.maven.lifecycle.internal.LifecycleStarter.execute(LifecycleStarter.java:128)
at org.apache.maven.DefaultMaven.doExecute(DefaultMaven.java:307)
at org.apache.maven.DefaultMaven.doExecute(DefaultMaven.java:193)
at org.apache.maven.DefaultMaven.execute(DefaultMaven.java:106)
at org.apache.maven.cli.MavenCli.execute(MavenCli.java:863)
at org.apache.maven.cli.MavenCli.doMain(MavenCli.java:288)
at org.apache.maven.cli.MavenCli.main(MavenCli.java:199)
at sun.reflect.NativeMethodAccessorImpl.invoke0(Native Method)
at sun.reflect.NativeMethodAccessorImpl.invoke(NativeMethodAccessorImpl.java:62)
at sun.reflect.DelegatingMethodAccessorImpl.invoke(DelegatingMethodAccessorImpl.java:43)
at java.lang.reflect.Method.invoke(Method.java:498)
at org.codehaus.plexus.classworlds.launcher.Launcher.launchEnhanced(Launcher.java:289)
at org.codehaus.plexus.classworlds.launcher.Launcher.launch(Launcher.java:229)
at org.codehaus.plexus.classworlds.launcher.Launcher.mainWithExitCode(Launcher.java:415)
at org.codehaus.plexus.classworlds.launcher.Launcher.main(Launcher.java:356)
Caused by: org.apache.maven.plugin.MojoFailureException: There are test failures.
Please refer to <https://fusesource-jenkins-rhel7.rhev-ci-vms.eng.rdu2.redhat.com/job/Fuse...> for the individual test results.
at org.eclipse.tycho.surefire.TestMojo.runTest(TestMojo.java:998)
at org.eclipse.tycho.surefire.TestMojo.execute(TestMojo.java:666)
at org.apache.maven.plugin.DefaultBuildPluginManager.executeMojo(DefaultBuildPluginManager.java:134)
at org.apache.maven.lifecycle.internal.MojoExecutor.execute(MojoExecutor.java:207)
... 20 more
[ERROR]
[ERROR] Re-run Maven using the -X switch to enable full debug logging.
[ERROR]
[ERROR] For more information about the errors and possible solutions, please read the following articles:
[ERROR] [Help 1] http://cwiki.apache.org/confluence/display/MAVEN/MojoFailureException
[ERROR]
[ERROR] After correcting the problems, you can resume the build with the command
[ERROR] mvn <goals> -rf :org.fusesource.ide.projecttemplates.tests.integration
Build step 'Invoke top-level Maven targets' marked build as failure
Terminating xvnc.
$ vncserver -kill :79
Killing Xvnc process ID 21816
Archiving artifacts
Recording test results
7 years, 11 months
Build failed in Jenkins: Fuse-Tooling-pullrequest #1024
by Fuse Infra Team
See <https://fusesource-jenkins-rhel7.rhev-ci-vms.eng.rdu2.redhat.com/job/Fuse...>
Changes:
[Aurelien Pupier] Remove useless instanceof operators which returns always true
------------------------------------------
[...truncated 48651 lines...]
testKaraf[0](org.fusesource.ide.server.tests.bean.KarafServerBean3xIT) Time elapsed: 0.029 sec
Running org.fusesource.ide.server.tests.bean.FuseESBServerBean6xIT
Tests run: 2, Failures: 0, Errors: 0, Skipped: 0, Time elapsed: 0.007 sec - in org.fusesource.ide.server.tests.bean.FuseESBServerBean6xIT
testFuseESB[0](org.fusesource.ide.server.tests.bean.FuseESBServerBean6xIT) Time elapsed: 0.002 sec
testFuseESB[1](org.fusesource.ide.server.tests.bean.FuseESBServerBean6xIT) Time elapsed: 0.001 sec
Running org.fusesource.ide.server.tests.bean.KarafServerBean2xIT
Tests run: 2, Failures: 0, Errors: 0, Skipped: 0, Time elapsed: 0.005 sec - in org.fusesource.ide.server.tests.bean.KarafServerBean2xIT
testKaraf[0](org.fusesource.ide.server.tests.bean.KarafServerBean2xIT) Time elapsed: 0.002 sec
testKaraf[1](org.fusesource.ide.server.tests.bean.KarafServerBean2xIT) Time elapsed: 0.001 sec
Running org.fusesource.ide.server.tests.locator.KarafRuntime2xLocatorIT
Tests run: 2, Failures: 0, Errors: 0, Skipped: 0, Time elapsed: 0.033 sec - in org.fusesource.ide.server.tests.locator.KarafRuntime2xLocatorIT
testKaraf[0](org.fusesource.ide.server.tests.locator.KarafRuntime2xLocatorIT) Time elapsed: 0.024 sec
testKaraf[1](org.fusesource.ide.server.tests.locator.KarafRuntime2xLocatorIT) Time elapsed: 0.005 sec
Running org.fusesource.ide.server.tests.locator.KarafRuntime3xLocatorIT
Tests run: 1, Failures: 0, Errors: 0, Skipped: 0, Time elapsed: 0.01 sec - in org.fusesource.ide.server.tests.locator.KarafRuntime3xLocatorIT
testKaraf[0](org.fusesource.ide.server.tests.locator.KarafRuntime3xLocatorIT) Time elapsed: 0.008 sec
Running org.fusesource.ide.server.tests.locator.FuseESBRuntime6xLocatorIT
Tests run: 2, Failures: 0, Errors: 0, Skipped: 0, Time elapsed: 0.016 sec - in org.fusesource.ide.server.tests.locator.FuseESBRuntime6xLocatorIT
testFuseESB[0](org.fusesource.ide.server.tests.locator.FuseESBRuntime6xLocatorIT) Time elapsed: 0.009 sec
testFuseESB[1](org.fusesource.ide.server.tests.locator.FuseESBRuntime6xLocatorIT) Time elapsed: 0.006 sec
Results :
Tests run: 10, Failures: 0, Errors: 0, Skipped: 0
[INFO] All tests passed!
[INFO]
[INFO] --- jacoco-maven-plugin:0.7.9:report (jacoco-site) @ org.fusesource.ide.server.tests ---
[INFO] Skipping JaCoCo execution due to missing execution data file.
[INFO]
[INFO] --- tycho-p2-extras-plugin:0.26.0:compare-version-with-baselines (default) @ org.fusesource.ide.server.tests ---
[INFO]
[INFO] ------------------------------------------------------------------------
[INFO] Building JBoss Fuse Tooling :: Update Site 9.2.0-SNAPSHOT
[INFO] ------------------------------------------------------------------------
[INFO]
[INFO] --- maven-clean-plugin:3.0.0:clean (default-clean) @ org.fusesource.ide.updatesite ---
[INFO]
[INFO] --- tycho-packaging-plugin:0.26.0:build-qualifier-aggregator (default-build-qualifier-aggregator) @ org.fusesource.ide.updatesite ---
[INFO] The project's OSGi version is 9.2.0.v20170322-0835
[INFO]
[INFO] --- build-helper-maven-plugin:1.7:regex-property (regex-property) @ org.fusesource.ide.updatesite ---
[INFO] Setting property 'skipTestsOrITests' to ''.
[INFO]
[INFO] --- maven-enforcer-plugin:1.4.1:enforce (core-has-ui-deps) @ org.fusesource.ide.updatesite ---
[INFO]
[INFO] --- maven-enforcer-plugin:1.4.1:enforce (warn-no-snapshots-AMx) @ org.fusesource.ide.updatesite ---
[ERROR] Found property update.site.version = 9.2.0-SNAPSHOT.LOCAL
[INFO]
[INFO] --- maven-enforcer-plugin:1.4.1:enforce (enforce-no-snapshots-Final) @ org.fusesource.ide.updatesite ---
[ERROR] Found property update.site.version = 9.2.0-SNAPSHOT.LOCAL
[INFO]
[INFO] --- maven-clean-plugin:3.0.0:clean (default-clean-1) @ org.fusesource.ide.updatesite ---
[INFO]
[INFO] --- jacoco-maven-plugin:0.7.9:prepare-agent (default) @ org.fusesource.ide.updatesite ---
[INFO] argLine set to -javaagent:<https://fusesource-jenkins-rhel7.rhev-ci-vms.eng.rdu2.redhat.com/job/Fuse...>
[INFO]
[INFO] --- jacoco-maven-plugin:0.7.9:prepare-agent (agent-for-ut) @ org.fusesource.ide.updatesite ---
[INFO] argLine set to -javaagent:<https://fusesource-jenkins-rhel7.rhev-ci-vms.eng.rdu2.redhat.com/job/Fuse...>:org.jboss.tools.fuse.*
[INFO]
[INFO] --- maven-resources-plugin:2.7:resources (default-resources) @ org.fusesource.ide.updatesite ---
[INFO] Using 'UTF-8' encoding to copy filtered resources.
[INFO] skip non existing resourceDirectory <https://fusesource-jenkins-rhel7.rhev-ci-vms.eng.rdu2.redhat.com/job/Fuse...>
[INFO]
[INFO] --- maven-compiler-plugin:3.5.1:testCompile (compiletests) @ org.fusesource.ide.updatesite ---
[INFO] No sources to compile
[INFO]
[INFO] --- maven-surefire-plugin:2.19.1:test (test) @ org.fusesource.ide.updatesite ---
[INFO] No tests to run.
[INFO]
[INFO] --- tycho-source-plugin:0.26.0:plugin-source (plugin-source) @ org.fusesource.ide.updatesite ---
[INFO]
[INFO] --- target-platform-configuration:0.26.0:target-platform (default-target-platform) @ org.fusesource.ide.updatesite ---
[INFO]
[INFO] --- tycho-p2-publisher-plugin:0.26.0:publish-products (default-publish-products) @ org.fusesource.ide.updatesite ---
[INFO]
[INFO] --- tycho-p2-publisher-plugin:0.26.0:publish-categories (default-publish-categories) @ org.fusesource.ide.updatesite ---
[INFO]
[INFO] --- tycho-p2-publisher-plugin:0.26.0:attach-artifacts (default-attach-artifacts) @ org.fusesource.ide.updatesite ---
[INFO]
[INFO] --- tycho-p2-repository-plugin:0.26.0:assemble-repository (default-assemble-repository) @ org.fusesource.ide.updatesite ---
[INFO]
[INFO] --- tycho-p2-repository-plugin:0.26.0:archive-repository (default-archive-repository) @ org.fusesource.ide.updatesite ---
[INFO] Building zip: <https://fusesource-jenkins-rhel7.rhev-ci-vms.eng.rdu2.redhat.com/job/Fuse...>
[INFO]
[INFO] --- tycho-source-feature-plugin:0.26.0:source-feature (source-feature) @ org.fusesource.ide.updatesite ---
[INFO]
[INFO] --- tycho-p2-plugin:0.26.0:p2-metadata (attached-p2-metadata) @ org.fusesource.ide.updatesite ---
[INFO]
[INFO] --- repository-utils:0.26.0:generate-repository-facade (generate-facade) @ org.fusesource.ide.updatesite ---
[INFO] Building zip: <https://fusesource-jenkins-rhel7.rhev-ci-vms.eng.rdu2.redhat.com/job/Fuse...>
[INFO]
[INFO] --- jacoco-maven-plugin:0.7.9:prepare-agent-integration (agent-for-it) @ org.fusesource.ide.updatesite ---
[INFO] argLine set to -javaagent:<https://fusesource-jenkins-rhel7.rhev-ci-vms.eng.rdu2.redhat.com/job/Fuse...>:org.jboss.tools.fuse.*
[INFO]
[INFO] --- jacoco-maven-plugin:0.7.9:report (jacoco-site) @ org.fusesource.ide.updatesite ---
[INFO] Skipping JaCoCo execution due to missing execution data file.
[INFO]
[INFO] --- tycho-p2-extras-plugin:0.26.0:compare-version-with-baselines (default) @ org.fusesource.ide.updatesite ---
[INFO] ------------------------------------------------------------------------
[INFO] Reactor Summary:
[INFO]
[INFO] JBoss Fuse Tooling :: Build Configuration .......... SUCCESS [ 9.484 s]
[INFO] JBoss Fuse Tooling ................................. SUCCESS [ 23.403 s]
[INFO] JBoss Fuse Tooling :: Tools ........................ SUCCESS [ 0.012 s]
[INFO] JBoss Fuse Tooling :: Tools :: IDE Camel Catalog Generator SUCCESS [02:02 min]
[INFO] JBoss Fuse Tooling :: Core ......................... SUCCESS [ 0.013 s]
[INFO] JBoss Fuse Tooling :: Core :: Plugins .............. SUCCESS [ 0.011 s]
[INFO] JBoss Fuse Tooling :: Core :: Plugins :: Foundation Core SUCCESS [ 25.233 s]
[INFO] JBoss Fuse Tooling :: Core :: Plugins :: Preferences SUCCESS [ 0.188 s]
[INFO] JBoss Fuse Tooling :: Core :: Plugins :: Foundation UI SUCCESS [ 0.833 s]
[INFO] JBoss Fuse Tooling :: Core :: Plugins :: Camel Model Service API SUCCESS [ 8.570 s]
[INFO] JBoss Fuse Tooling :: Core :: Plugins :: Camel 2.15.1.redhat-621084 Service Implementation SUCCESS [ 2.347 s]
[INFO] JBoss Fuse Tooling :: Core :: Plugins :: Camel 2.15.1.redhat-621117 Service Implementation SUCCESS [ 1.914 s]
[INFO] JBoss Fuse Tooling :: Core :: Plugins :: Camel 2.17.0.redhat-630187 Service Implementation SUCCESS [ 18.018 s]
[INFO] JBoss Fuse Tooling :: Core :: Plugins :: Camel 2.17.0.redhat-630224 Service Implementation SUCCESS [ 15.473 s]
[INFO] JBoss Fuse Tooling :: Core :: Plugins :: Camel 2.17.3 Service Implementation SUCCESS [ 4.112 s]
[INFO] JBoss Fuse Tooling :: Core :: Plugins :: Camel 2.18.1.redhat-000012 Service Implementation SUCCESS [ 15.564 s]
[INFO] JBoss Fuse Tooling :: Core :: Plugins :: Maven ..... SUCCESS [ 0.299 s]
[INFO] JBoss Fuse Tooling :: Camel Editor ................. SUCCESS [ 0.011 s]
[INFO] JBoss Fuse Tooling :: Camel Editor :: Plugins ...... SUCCESS [ 0.009 s]
[INFO] JBoss Fuse Tooling :: Camel Editor :: Plugins :: Branding SUCCESS [ 0.516 s]
[INFO] JBoss Fuse Tooling :: Core :: Plugins :: Camel Validation SUCCESS [ 0.379 s]
[INFO] JBoss Fuse Tooling :: Core :: Plugins :: Cheat Sheets SUCCESS [ 0.093 s]
[INFO] JBoss Fuse Tooling :: Core :: Plugins :: Graph ..... SUCCESS [ 0.296 s]
[INFO] JBoss Fuse Tooling :: Core :: Plugins :: Help ...... SUCCESS [ 4.085 s]
[INFO] JBoss Fuse Tooling :: Core :: Plugins :: Imports ... SUCCESS [ 0.269 s]
[INFO] JBoss Fuse Tooling :: Core :: Plugins :: Branding .. SUCCESS [ 0.090 s]
[INFO] JBoss Fuse Tooling :: Core :: Tests ................ SUCCESS [ 0.008 s]
[INFO] JBoss Fuse Tooling :: Core :: Tests :: Camel Service Core Tests SUCCESS [ 3.090 s]
[INFO] JBoss Fuse Tooling :: JMX .......................... SUCCESS [ 0.011 s]
[INFO] JBoss Fuse Tooling :: JMX :: Plugins ............... SUCCESS [ 0.008 s]
[INFO] JBoss Fuse Tooling :: JMX :: Plugins :: JMX Commons SUCCESS [ 0.384 s]
[INFO] JBoss Fuse Tooling :: Camel Editor :: Plugins :: Launcher SUCCESS [ 0.402 s]
[INFO] JBoss Fuse Tooling :: Camel Editor :: Plugins :: Camel Editor SUCCESS [ 0.980 s]
[INFO] JBoss Fuse Tooling :: Core :: Tests :: Camel Service Core Integration Tests SUCCESS [ 37.026 s]
[INFO] JBoss Fuse Tooling :: Core :: Tests :: Camel Model Tests SUCCESS [ 8.347 s]
[INFO] JBoss Fuse Tooling :: Core :: Tests :: Camel Validation Integration Tests SUCCESS [ 0.530 s]
[INFO] JBoss Fuse Tooling :: Core :: Tests :: Camel Validation Tests SUCCESS [ 1.680 s]
[INFO] JBoss Fuse Tooling :: Camel Editor :: Plugins :: Project SUCCESS [ 0.510 s]
[INFO] JBoss Fuse Tooling :: Camel Editor :: Plugins :: Project Templates SUCCESS [ 3.399 s]
[INFO] JBoss Fuse Tooling :: Camel Editor :: Tests ........ SUCCESS [ 0.008 s]
[INFO] JBoss Fuse Tooling :: Camel Editor :: Tests :: Camel Editor Integration Tests SUCCESS [05:33 min]
[INFO] JBoss Fuse Tooling :: Core :: Tests :: Camel Validation Integration Tests SUCCESS [ 15.533 s]
[INFO] JBoss Fuse Tooling :: Core :: Features ............. SUCCESS [ 0.010 s]
[INFO] JBoss Fuse Tooling :: Core :: Features :: Core Feature SUCCESS [ 0.301 s]
[INFO] JBoss Fuse Tooling :: Camel Editor :: Plugins :: XSD Catalogs SUCCESS [ 0.141 s]
[INFO] JBoss Fuse Tooling :: Camel Editor :: Plugins :: Launcher UI SUCCESS [ 0.370 s]
[INFO] JBoss Fuse Tooling :: Camel Editor :: Tests :: Camel Editor Tests SUCCESS [ 3.649 s]
[INFO] JBoss Fuse Tooling :: Camel Editor :: Tests :: Camel IDE Launcher Tests SUCCESS [ 1.810 s]
[INFO] JBoss Fuse Tooling :: Camel Editor :: Tests :: Launcher UI Tests SUCCESS [ 2.016 s]
[INFO] JBoss Fuse Tooling :: Camel Editor :: Tests :: Camel IDE Launcher UI Integration Tests SUCCESS [ 8.817 s]
[INFO] JBoss Fuse Tooling :: Camel Editor :: Tests :: Camel IDE Project Integration Tests SUCCESS [ 9.452 s]
[INFO] JBoss Fuse Tooling :: Camel Editor :: Tests :: Project Templates Tests SUCCESS [ 1.838 s]
[INFO] JBoss Fuse Tooling :: Camel Editor :: Tests :: Project Templates Integration Tests FAILURE [18:33 min]
[INFO] JBoss Fuse Tooling :: Camel Editor :: Features ..... SUCCESS [ 0.009 s]
[INFO] JBoss Fuse Tooling :: Camel Editor :: Features :: Camel Editor Feature SUCCESS [ 0.235 s]
[INFO] JBoss Fuse Tooling :: Data Transformation .......... SUCCESS [ 0.007 s]
[INFO] JBoss Fuse Tooling :: Data Transformation :: Plugins SUCCESS [ 0.007 s]
[INFO] JBoss Fuse Tooling :: Data Transformation :: Plugins :: Core SUCCESS [ 2.744 s]
[INFO] JBoss Fuse Tooling :: Data Transformation :: Plugins :: Editor SUCCESS [ 0.800 s]
[INFO] JBoss Fuse Tooling :: Data Transformation :: Features SUCCESS [ 0.007 s]
[INFO] JBoss Fuse Tooling :: Data Transformation :: Features :: Data Transformation Feature SUCCESS [ 0.257 s]
[INFO] JBoss Fuse Tooling :: Core Transformation :: Tests . SUCCESS [ 0.009 s]
[INFO] JBoss Fuse Tooling :: Core Transformation :: Tests :: Core Transformation Tests SUCCESS [ 2.571 s]
[INFO] JBoss Fuse Tooling :: Core Transformation :: Tests :: Core Transformation Integration Tests SUCCESS [ 9.359 s]
[INFO] JBoss Fuse Tooling :: Editor Transformation :: Tests :: Editor Transformation Tests SUCCESS [ 1.615 s]
[INFO] JBoss Fuse Tooling :: Transformation Editor :: Tests :: Transformation Editor Integration Tests SUCCESS [ 10.503 s]
[INFO] JBoss Fuse Tooling :: JMX :: Plugins :: Apache ActiveMQ Facade SUCCESS [ 7.817 s]
[INFO] JBoss Fuse Tooling :: JMX :: Plugins :: Apache Camel Facade SUCCESS [ 0.421 s]
[INFO] JBoss Fuse Tooling :: JMX :: Plugins :: JMX Diagram View SUCCESS [ 0.364 s]
[INFO] JBoss Fuse Tooling :: Server Adapters .............. SUCCESS [ 0.007 s]
[INFO] JBoss Fuse Tooling :: Server Adapters :: Plugins ... SUCCESS [ 0.006 s]
[INFO] JBoss Fuse Tooling :: Server Adapters :: Plugins :: Apache Karaf Adapter Core SUCCESS [ 0.461 s]
[INFO] JBoss Fuse Tooling :: JMX :: Plugins :: Apache Karaf Facade SUCCESS [ 0.396 s]
[INFO] JBoss Fuse Tooling :: JMX :: Tests ................. SUCCESS [ 0.007 s]
[INFO] JBoss Fuse Tooling :: JMX :: Tests ::Camel ......... SUCCESS [ 1.501 s]
[INFO] JBoss Fuse Tooling :: JMX :: Integration Tests :: Camel SUCCESS [ 7.292 s]
[INFO] JBoss Fuse Tooling :: JMX :: Tests :: Commons ...... SUCCESS [ 1.724 s]
[INFO] JBoss Fuse Tooling :: JMX :: Tests :: Diagram ::View SUCCESS [ 1.910 s]
[INFO] JBoss Fuse Tooling :: JMX :: Features .............. SUCCESS [ 0.009 s]
[INFO] JBoss Fuse Tooling :: Server Adapters :: Plugins :: Commons SUCCESS [ 0.241 s]
[INFO] JBoss Fuse Tooling :: Server Adapters :: Plugins :: Apache Karaf Adapter UI SUCCESS [ 0.401 s]
[INFO] JBoss Fuse Tooling :: Server Adapters :: Plugins :: JBoss Fuse Adapter Core SUCCESS [ 0.317 s]
[INFO] JBoss Fuse Tooling :: Server Adapters :: Plugins :: JBoss Fuse Adapter UI SUCCESS [ 0.352 s]
[INFO] JBoss Fuse Tooling :: Server Adapters :: Features .. SUCCESS [ 0.007 s]
[INFO] JBoss Fuse Tooling :: Server Adapters :: Features :: Server Adapters Feature SUCCESS [ 0.263 s]
[INFO] JBoss Fuse Tooling :: JMX :: Features :: JMX Feature SUCCESS [ 0.242 s]
[INFO] JBoss Fuse Tooling :: Server Adapters :: Tests ..... SUCCESS [ 0.007 s]
[INFO] JBoss Fuse Tooling :: Server Adapters :: Tests :: Karaf Core Tests SUCCESS [ 1.636 s]
[INFO] JBoss Fuse Tooling :: Server Adapters :: Tests :: Server Tests SUCCESS [ 9.712 s]
[INFO] JBoss Fuse Tooling :: Update Site .................. SUCCESS [ 9.770 s]
[INFO] ------------------------------------------------------------------------
[INFO] BUILD FAILURE
[INFO] ------------------------------------------------------------------------
[INFO] Total time: 39:13 min
[INFO] Finished at: 2017-03-22T05:17:34-04:00
[INFO] Final Memory: 380M/1621M
[INFO] ------------------------------------------------------------------------
[ERROR] Failed to execute goal org.eclipse.tycho:tycho-surefire-plugin:0.26.0:test (default-test) on project org.fusesource.ide.projecttemplates.tests.integration: There are test failures.
[ERROR]
[ERROR] Please refer to <https://fusesource-jenkins-rhel7.rhev-ci-vms.eng.rdu2.redhat.com/job/Fuse...> for the individual test results.
[ERROR] -> [Help 1]
org.apache.maven.lifecycle.LifecycleExecutionException: Failed to execute goal org.eclipse.tycho:tycho-surefire-plugin:0.26.0:test (default-test) on project org.fusesource.ide.projecttemplates.tests.integration: There are test failures.
Please refer to <https://fusesource-jenkins-rhel7.rhev-ci-vms.eng.rdu2.redhat.com/job/Fuse...> for the individual test results.
at org.apache.maven.lifecycle.internal.MojoExecutor.execute(MojoExecutor.java:212)
at org.apache.maven.lifecycle.internal.MojoExecutor.execute(MojoExecutor.java:153)
at org.apache.maven.lifecycle.internal.MojoExecutor.execute(MojoExecutor.java:145)
at org.apache.maven.lifecycle.internal.LifecycleModuleBuilder.buildProject(LifecycleModuleBuilder.java:116)
at org.apache.maven.lifecycle.internal.LifecycleModuleBuilder.buildProject(LifecycleModuleBuilder.java:80)
at org.apache.maven.lifecycle.internal.builder.singlethreaded.SingleThreadedBuilder.build(SingleThreadedBuilder.java:51)
at org.apache.maven.lifecycle.internal.LifecycleStarter.execute(LifecycleStarter.java:128)
at org.apache.maven.DefaultMaven.doExecute(DefaultMaven.java:307)
at org.apache.maven.DefaultMaven.doExecute(DefaultMaven.java:193)
at org.apache.maven.DefaultMaven.execute(DefaultMaven.java:106)
at org.apache.maven.cli.MavenCli.execute(MavenCli.java:863)
at org.apache.maven.cli.MavenCli.doMain(MavenCli.java:288)
at org.apache.maven.cli.MavenCli.main(MavenCli.java:199)
at sun.reflect.NativeMethodAccessorImpl.invoke0(Native Method)
at sun.reflect.NativeMethodAccessorImpl.invoke(NativeMethodAccessorImpl.java:62)
at sun.reflect.DelegatingMethodAccessorImpl.invoke(DelegatingMethodAccessorImpl.java:43)
at java.lang.reflect.Method.invoke(Method.java:498)
at org.codehaus.plexus.classworlds.launcher.Launcher.launchEnhanced(Launcher.java:289)
at org.codehaus.plexus.classworlds.launcher.Launcher.launch(Launcher.java:229)
at org.codehaus.plexus.classworlds.launcher.Launcher.mainWithExitCode(Launcher.java:415)
at org.codehaus.plexus.classworlds.launcher.Launcher.main(Launcher.java:356)
Caused by: org.apache.maven.plugin.MojoFailureException: There are test failures.
Please refer to <https://fusesource-jenkins-rhel7.rhev-ci-vms.eng.rdu2.redhat.com/job/Fuse...> for the individual test results.
at org.eclipse.tycho.surefire.TestMojo.runTest(TestMojo.java:998)
at org.eclipse.tycho.surefire.TestMojo.execute(TestMojo.java:666)
at org.apache.maven.plugin.DefaultBuildPluginManager.executeMojo(DefaultBuildPluginManager.java:134)
at org.apache.maven.lifecycle.internal.MojoExecutor.execute(MojoExecutor.java:207)
... 20 more
[ERROR]
[ERROR] Re-run Maven using the -X switch to enable full debug logging.
[ERROR]
[ERROR] For more information about the errors and possible solutions, please read the following articles:
[ERROR] [Help 1] http://cwiki.apache.org/confluence/display/MAVEN/MojoFailureException
[ERROR]
[ERROR] After correcting the problems, you can resume the build with the command
[ERROR] mvn <goals> -rf :org.fusesource.ide.projecttemplates.tests.integration
Build step 'Invoke top-level Maven targets' marked build as failure
Terminating xvnc.
$ vncserver -kill :38
Killing Xvnc process ID 2743
Archiving artifacts
Recording test results
7 years, 11 months
Build failed in Jenkins: Fuse-Tooling-9.2.x-Update-Site #81
by Fuse Infra Team
See <https://fusesource-jenkins-rhel7.rhev-ci-vms.eng.rdu2.redhat.com/job/Fuse...>
Changes:
[Aurelien Pupier] FUSETOOLS-2330 - Avoid JavaModelException if not a Java Project
------------------------------------------
[...truncated 13009 lines...]
[INFO] tycho.testArgLine set to -javaagent:<https://fusesource-jenkins-rhel7.rhev-ci-vms.eng.rdu2.redhat.com/job/Fuse...>:org.jboss.tools.fuse.*
[INFO]
[INFO] --- tycho-surefire-plugin:0.26.0:test (default-test) @ org.fusesource.ide.server.tests ---
[INFO] Expected eclipse log file: <https://fusesource-jenkins-rhel7.rhev-ci-vms.eng.rdu2.redhat.com/job/Fuse...> sp(a)xn--c/-bja.metadata/.log
[INFO] Command line:
[/usr/lib/jvm/java-1.8.0-openjdk-1.8.0.121-0.b13.el7_3.x86_64/jre/bin/java, -Dosgi.noShutdown=false, -Dosgi.os=linux, -Dosgi.ws=gtk, -Dosgi.arch=x86_64, -javaagent:<https://fusesource-jenkins-rhel7.rhev-ci-vms.eng.rdu2.redhat.com/job/Fuse...>:org.jboss.tools.fuse.*, -XX:+HeapDumpOnOutOfMemoryError, -Dusage_reporting_enabled=false, -Dorg.jboss.tools.vpe.loadxulrunner=false, -Dosgi.clean=true, -jar, <https://fusesource-jenkins-rhel7.rhev-ci-vms.eng.rdu2.redhat.com/job/Fuse...,> -data, <https://fusesource-jenkins-rhel7.rhev-ci-vms.eng.rdu2.redhat.com/job/Fuse...> sp@cé, -install, <https://fusesource-jenkins-rhel7.rhev-ci-vms.eng.rdu2.redhat.com/job/Fuse...,> -configuration, <https://fusesource-jenkins-rhel7.rhev-ci-vms.eng.rdu2.redhat.com/job/Fuse...,> -application, org.eclipse.tycho.surefire.osgibooter.uitest, -testproperties, <https://fusesource-jenkins-rhel7.rhev-ci-vms.eng.rdu2.redhat.com/job/Fuse...]>
-------------------------------------------------------
T E S T S
-------------------------------------------------------
Running org.fusesource.ide.server.tests.bean.FuseESBServerBean6xIT
Tests run: 2, Failures: 0, Errors: 0, Skipped: 0, Time elapsed: 0.061 sec - in org.fusesource.ide.server.tests.bean.FuseESBServerBean6xIT
testFuseESB[0](org.fusesource.ide.server.tests.bean.FuseESBServerBean6xIT) Time elapsed: 0.027 sec
testFuseESB[1](org.fusesource.ide.server.tests.bean.FuseESBServerBean6xIT) Time elapsed: 0.002 sec
Running org.fusesource.ide.server.tests.bean.KarafServerBean3xIT
Tests run: 1, Failures: 0, Errors: 0, Skipped: 0, Time elapsed: 0.007 sec - in org.fusesource.ide.server.tests.bean.KarafServerBean3xIT
testKaraf[0](org.fusesource.ide.server.tests.bean.KarafServerBean3xIT) Time elapsed: 0.003 sec
Running org.fusesource.ide.server.tests.bean.KarafServerBean2xIT
Tests run: 2, Failures: 0, Errors: 0, Skipped: 0, Time elapsed: 0.004 sec - in org.fusesource.ide.server.tests.bean.KarafServerBean2xIT
testKaraf[0](org.fusesource.ide.server.tests.bean.KarafServerBean2xIT) Time elapsed: 0.002 sec
testKaraf[1](org.fusesource.ide.server.tests.bean.KarafServerBean2xIT) Time elapsed: 0.001 sec
Running org.fusesource.ide.server.tests.locator.KarafRuntime2xLocatorIT
Tests run: 2, Failures: 0, Errors: 0, Skipped: 0, Time elapsed: 0.033 sec - in org.fusesource.ide.server.tests.locator.KarafRuntime2xLocatorIT
testKaraf[0](org.fusesource.ide.server.tests.locator.KarafRuntime2xLocatorIT) Time elapsed: 0.024 sec
testKaraf[1](org.fusesource.ide.server.tests.locator.KarafRuntime2xLocatorIT) Time elapsed: 0.006 sec
Running org.fusesource.ide.server.tests.locator.FuseESBRuntime6xLocatorIT
Tests run: 2, Failures: 0, Errors: 0, Skipped: 0, Time elapsed: 0.014 sec - in org.fusesource.ide.server.tests.locator.FuseESBRuntime6xLocatorIT
testFuseESB[0](org.fusesource.ide.server.tests.locator.FuseESBRuntime6xLocatorIT) Time elapsed: 0.008 sec
testFuseESB[1](org.fusesource.ide.server.tests.locator.FuseESBRuntime6xLocatorIT) Time elapsed: 0.004 sec
Running org.fusesource.ide.server.tests.locator.KarafRuntime3xLocatorIT
Tests run: 1, Failures: 0, Errors: 0, Skipped: 0, Time elapsed: 0.009 sec - in org.fusesource.ide.server.tests.locator.KarafRuntime3xLocatorIT
testKaraf[0](org.fusesource.ide.server.tests.locator.KarafRuntime3xLocatorIT) Time elapsed: 0.008 sec
Results :
Tests run: 10, Failures: 0, Errors: 0, Skipped: 0
[INFO] All tests passed!
[INFO]
[INFO] --- jacoco-maven-plugin:0.7.9:report (jacoco-site) @ org.fusesource.ide.server.tests ---
[INFO] Skipping JaCoCo execution due to missing execution data file.
[INFO]
[INFO] --- tycho-p2-extras-plugin:0.26.0:compare-version-with-baselines (default) @ org.fusesource.ide.server.tests ---
[INFO]
[INFO] --- maven-install-plugin:2.3.1:install (default-install) @ org.fusesource.ide.server.tests ---
[INFO] Installing <https://fusesource-jenkins-rhel7.rhev-ci-vms.eng.rdu2.redhat.com/job/Fuse...> to <https://fusesource-jenkins-rhel7.rhev-ci-vms.eng.rdu2.redhat.com/job/Fuse...>
[INFO] Installing <https://fusesource-jenkins-rhel7.rhev-ci-vms.eng.rdu2.redhat.com/job/Fuse...> to <https://fusesource-jenkins-rhel7.rhev-ci-vms.eng.rdu2.redhat.com/job/Fuse...>
[INFO] Installing <https://fusesource-jenkins-rhel7.rhev-ci-vms.eng.rdu2.redhat.com/job/Fuse...> to <https://fusesource-jenkins-rhel7.rhev-ci-vms.eng.rdu2.redhat.com/job/Fuse...>
[INFO] Installing <https://fusesource-jenkins-rhel7.rhev-ci-vms.eng.rdu2.redhat.com/job/Fuse...> to <https://fusesource-jenkins-rhel7.rhev-ci-vms.eng.rdu2.redhat.com/job/Fuse...>
[INFO] Installing <https://fusesource-jenkins-rhel7.rhev-ci-vms.eng.rdu2.redhat.com/job/Fuse...> to <https://fusesource-jenkins-rhel7.rhev-ci-vms.eng.rdu2.redhat.com/job/Fuse...>
[INFO] Installing <https://fusesource-jenkins-rhel7.rhev-ci-vms.eng.rdu2.redhat.com/job/Fuse...> to <https://fusesource-jenkins-rhel7.rhev-ci-vms.eng.rdu2.redhat.com/job/Fuse...>
[INFO] Installing <https://fusesource-jenkins-rhel7.rhev-ci-vms.eng.rdu2.redhat.com/job/Fuse...> to <https://fusesource-jenkins-rhel7.rhev-ci-vms.eng.rdu2.redhat.com/job/Fuse...>
[INFO]
[INFO] --- tycho-p2-plugin:0.26.0:update-local-index (default-update-local-index) @ org.fusesource.ide.server.tests ---
[INFO]
[INFO] ------------------------------------------------------------------------
[INFO] Building JBoss Fuse Tooling :: Update Site 9.2.0-SNAPSHOT
[INFO] ------------------------------------------------------------------------
[INFO]
[INFO] --- maven-clean-plugin:3.0.0:clean (default-clean) @ org.fusesource.ide.updatesite ---
[INFO]
[INFO] --- tycho-packaging-plugin:0.26.0:build-qualifier-aggregator (default-build-qualifier-aggregator) @ org.fusesource.ide.updatesite ---
[INFO] The project's OSGi version is 9.2.0.CI-v20170321-1002-B81
[INFO]
[INFO] --- build-helper-maven-plugin:1.7:regex-property (regex-property) @ org.fusesource.ide.updatesite ---
[INFO] Setting property 'skipTestsOrITests' to ''.
[INFO]
[INFO] --- maven-enforcer-plugin:1.4.1:enforce (core-has-ui-deps) @ org.fusesource.ide.updatesite ---
[INFO]
[INFO] --- maven-enforcer-plugin:1.4.1:enforce (warn-no-snapshots-AMx) @ org.fusesource.ide.updatesite ---
[ERROR] Found property update.site.version = 9.2.0-SNAPSHOT.CI
[INFO]
[INFO] --- maven-enforcer-plugin:1.4.1:enforce (enforce-no-snapshots-Final) @ org.fusesource.ide.updatesite ---
[ERROR] Found property update.site.version = 9.2.0-SNAPSHOT.CI
[INFO]
[INFO] --- maven-clean-plugin:3.0.0:clean (default-clean-1) @ org.fusesource.ide.updatesite ---
[INFO]
[INFO] --- jacoco-maven-plugin:0.7.9:prepare-agent (default) @ org.fusesource.ide.updatesite ---
[INFO] argLine set to -javaagent:<https://fusesource-jenkins-rhel7.rhev-ci-vms.eng.rdu2.redhat.com/job/Fuse...>
[INFO]
[INFO] --- jacoco-maven-plugin:0.7.9:prepare-agent (agent-for-ut) @ org.fusesource.ide.updatesite ---
[INFO] argLine set to -javaagent:<https://fusesource-jenkins-rhel7.rhev-ci-vms.eng.rdu2.redhat.com/job/Fuse...>:org.jboss.tools.fuse.*
[INFO]
[INFO] --- maven-resources-plugin:2.7:resources (default-resources) @ org.fusesource.ide.updatesite ---
[INFO] Using 'UTF-8' encoding to copy filtered resources.
[INFO] skip non existing resourceDirectory <https://fusesource-jenkins-rhel7.rhev-ci-vms.eng.rdu2.redhat.com/job/Fuse...>
[INFO]
[INFO] --- maven-compiler-plugin:3.5.1:testCompile (compiletests) @ org.fusesource.ide.updatesite ---
[INFO] No sources to compile
[INFO]
[INFO] --- maven-surefire-plugin:2.19.1:test (test) @ org.fusesource.ide.updatesite ---
[INFO] No tests to run.
[INFO]
[INFO] --- tycho-source-plugin:0.26.0:plugin-source (plugin-source) @ org.fusesource.ide.updatesite ---
[INFO]
[INFO] --- target-platform-configuration:0.26.0:target-platform (default-target-platform) @ org.fusesource.ide.updatesite ---
[INFO]
[INFO] --- tycho-p2-publisher-plugin:0.26.0:publish-products (default-publish-products) @ org.fusesource.ide.updatesite ---
[INFO]
[INFO] --- tycho-p2-publisher-plugin:0.26.0:publish-categories (default-publish-categories) @ org.fusesource.ide.updatesite ---
[INFO]
[INFO] --- tycho-p2-publisher-plugin:0.26.0:attach-artifacts (default-attach-artifacts) @ org.fusesource.ide.updatesite ---
[INFO]
[INFO] --- tycho-p2-repository-plugin:0.26.0:assemble-repository (default-assemble-repository) @ org.fusesource.ide.updatesite ---
[INFO]
[INFO] --- tycho-p2-repository-plugin:0.26.0:archive-repository (default-archive-repository) @ org.fusesource.ide.updatesite ---
[INFO] Building zip: <https://fusesource-jenkins-rhel7.rhev-ci-vms.eng.rdu2.redhat.com/job/Fuse...>
[INFO]
[INFO] --- tycho-source-feature-plugin:0.26.0:source-feature (source-feature) @ org.fusesource.ide.updatesite ---
[INFO]
[INFO] --- tycho-p2-plugin:0.26.0:p2-metadata (attached-p2-metadata) @ org.fusesource.ide.updatesite ---
[INFO]
[INFO] --- repository-utils:0.26.0:generate-repository-facade (generate-facade) @ org.fusesource.ide.updatesite ---
[INFO] Building zip: <https://fusesource-jenkins-rhel7.rhev-ci-vms.eng.rdu2.redhat.com/job/Fuse...>
[INFO]
[INFO] --- jacoco-maven-plugin:0.7.9:prepare-agent-integration (agent-for-it) @ org.fusesource.ide.updatesite ---
[INFO] argLine set to -javaagent:<https://fusesource-jenkins-rhel7.rhev-ci-vms.eng.rdu2.redhat.com/job/Fuse...>:org.jboss.tools.fuse.*
[INFO]
[INFO] --- jacoco-maven-plugin:0.7.9:report (jacoco-site) @ org.fusesource.ide.updatesite ---
[INFO] Skipping JaCoCo execution due to missing execution data file.
[INFO]
[INFO] --- tycho-p2-extras-plugin:0.26.0:compare-version-with-baselines (default) @ org.fusesource.ide.updatesite ---
[INFO]
[INFO] --- maven-install-plugin:2.3.1:install (default-install) @ org.fusesource.ide.updatesite ---
[INFO] Installing <https://fusesource-jenkins-rhel7.rhev-ci-vms.eng.rdu2.redhat.com/job/Fuse...> to <https://fusesource-jenkins-rhel7.rhev-ci-vms.eng.rdu2.redhat.com/job/Fuse...>
[INFO] Installing <https://fusesource-jenkins-rhel7.rhev-ci-vms.eng.rdu2.redhat.com/job/Fuse...> to <https://fusesource-jenkins-rhel7.rhev-ci-vms.eng.rdu2.redhat.com/job/Fuse...>
[INFO] Installing <https://fusesource-jenkins-rhel7.rhev-ci-vms.eng.rdu2.redhat.com/job/Fuse...> to <https://fusesource-jenkins-rhel7.rhev-ci-vms.eng.rdu2.redhat.com/job/Fuse...>
[INFO] Installing <https://fusesource-jenkins-rhel7.rhev-ci-vms.eng.rdu2.redhat.com/job/Fuse...> to <https://fusesource-jenkins-rhel7.rhev-ci-vms.eng.rdu2.redhat.com/job/Fuse...>
[INFO]
[INFO] --- tycho-p2-plugin:0.26.0:update-local-index (default-update-local-index) @ org.fusesource.ide.updatesite ---
[INFO] ------------------------------------------------------------------------
[INFO] Reactor Summary:
[INFO]
[INFO] JBoss Fuse Tooling :: Build Configuration .......... SUCCESS [ 10.971 s]
[INFO] JBoss Fuse Tooling ................................. SUCCESS [ 22.790 s]
[INFO] JBoss Fuse Tooling :: Tools ........................ SUCCESS [ 0.014 s]
[INFO] JBoss Fuse Tooling :: Tools :: IDE Camel Catalog Generator SUCCESS [01:39 min]
[INFO] JBoss Fuse Tooling :: Core ......................... SUCCESS [ 0.017 s]
[INFO] JBoss Fuse Tooling :: Core :: Plugins .............. SUCCESS [ 0.013 s]
[INFO] JBoss Fuse Tooling :: Core :: Plugins :: Foundation Core SUCCESS [ 21.609 s]
[INFO] JBoss Fuse Tooling :: Core :: Plugins :: Preferences SUCCESS [ 0.207 s]
[INFO] JBoss Fuse Tooling :: Core :: Plugins :: Foundation UI SUCCESS [ 0.906 s]
[INFO] JBoss Fuse Tooling :: Core :: Plugins :: Camel Model Service API SUCCESS [ 8.922 s]
[INFO] JBoss Fuse Tooling :: Core :: Plugins :: Camel 2.15.1.redhat-621084 Service Implementation SUCCESS [ 2.173 s]
[INFO] JBoss Fuse Tooling :: Core :: Plugins :: Camel 2.15.1.redhat-621117 Service Implementation SUCCESS [ 1.869 s]
[INFO] JBoss Fuse Tooling :: Core :: Plugins :: Camel 2.17.0.redhat-630187 Service Implementation SUCCESS [ 17.642 s]
[INFO] JBoss Fuse Tooling :: Core :: Plugins :: Camel 2.17.0.redhat-630224 Service Implementation SUCCESS [ 18.380 s]
[INFO] JBoss Fuse Tooling :: Core :: Plugins :: Camel 2.17.3 Service Implementation SUCCESS [ 4.504 s]
[INFO] JBoss Fuse Tooling :: Core :: Plugins :: Camel 2.18.1.redhat-000012 Service Implementation SUCCESS [ 14.330 s]
[INFO] JBoss Fuse Tooling :: Core :: Plugins :: Maven ..... SUCCESS [ 0.301 s]
[INFO] JBoss Fuse Tooling :: Camel Editor ................. SUCCESS [ 0.014 s]
[INFO] JBoss Fuse Tooling :: Camel Editor :: Plugins ...... SUCCESS [ 0.011 s]
[INFO] JBoss Fuse Tooling :: Camel Editor :: Plugins :: Branding SUCCESS [ 0.538 s]
[INFO] JBoss Fuse Tooling :: Core :: Plugins :: Camel Validation SUCCESS [ 0.383 s]
[INFO] JBoss Fuse Tooling :: Core :: Plugins :: Cheat Sheets SUCCESS [ 0.100 s]
[INFO] JBoss Fuse Tooling :: Core :: Plugins :: Graph ..... SUCCESS [ 0.305 s]
[INFO] JBoss Fuse Tooling :: Core :: Plugins :: Help ...... SUCCESS [ 4.373 s]
[INFO] JBoss Fuse Tooling :: Core :: Plugins :: Imports ... SUCCESS [ 0.285 s]
[INFO] JBoss Fuse Tooling :: Core :: Plugins :: Branding .. SUCCESS [ 0.098 s]
[INFO] JBoss Fuse Tooling :: Core :: Tests ................ SUCCESS [ 0.012 s]
[INFO] JBoss Fuse Tooling :: Core :: Tests :: Camel Service Core Tests SUCCESS [ 2.800 s]
[INFO] JBoss Fuse Tooling :: JMX .......................... SUCCESS [ 0.014 s]
[INFO] JBoss Fuse Tooling :: JMX :: Plugins ............... SUCCESS [ 0.010 s]
[INFO] JBoss Fuse Tooling :: JMX :: Plugins :: JMX Commons SUCCESS [ 0.468 s]
[INFO] JBoss Fuse Tooling :: Camel Editor :: Plugins :: Launcher SUCCESS [ 0.464 s]
[INFO] JBoss Fuse Tooling :: Camel Editor :: Plugins :: Camel Editor SUCCESS [ 1.005 s]
[INFO] JBoss Fuse Tooling :: Core :: Tests :: Camel Service Core Integration Tests SUCCESS [ 56.767 s]
[INFO] JBoss Fuse Tooling :: Core :: Tests :: Camel Model Tests SUCCESS [ 8.315 s]
[INFO] JBoss Fuse Tooling :: Core :: Tests :: Camel Validation Integration Tests SUCCESS [ 0.567 s]
[INFO] JBoss Fuse Tooling :: Core :: Tests :: Camel Validation Tests SUCCESS [ 1.803 s]
[INFO] JBoss Fuse Tooling :: Camel Editor :: Plugins :: Project SUCCESS [ 0.461 s]
[INFO] JBoss Fuse Tooling :: Camel Editor :: Plugins :: Project Templates SUCCESS [ 3.428 s]
[INFO] JBoss Fuse Tooling :: Camel Editor :: Tests ........ SUCCESS [ 0.012 s]
[INFO] JBoss Fuse Tooling :: Camel Editor :: Tests :: Camel Editor Integration Tests SUCCESS [05:40 min]
[INFO] JBoss Fuse Tooling :: Core :: Tests :: Camel Validation Integration Tests SUCCESS [ 16.397 s]
[INFO] JBoss Fuse Tooling :: Core :: Features ............. SUCCESS [ 0.012 s]
[INFO] JBoss Fuse Tooling :: Core :: Features :: Core Feature SUCCESS [ 0.333 s]
[INFO] JBoss Fuse Tooling :: Camel Editor :: Plugins :: XSD Catalogs SUCCESS [ 0.150 s]
[INFO] JBoss Fuse Tooling :: Camel Editor :: Plugins :: Launcher UI SUCCESS [ 0.396 s]
[INFO] JBoss Fuse Tooling :: Camel Editor :: Tests :: Camel Editor Tests SUCCESS [ 4.187 s]
[INFO] JBoss Fuse Tooling :: Camel Editor :: Tests :: Camel IDE Launcher Tests SUCCESS [ 1.969 s]
[INFO] JBoss Fuse Tooling :: Camel Editor :: Tests :: Launcher UI Tests SUCCESS [ 1.998 s]
[INFO] JBoss Fuse Tooling :: Camel Editor :: Tests :: Camel IDE Launcher UI Integration Tests SUCCESS [ 9.424 s]
[INFO] JBoss Fuse Tooling :: Camel Editor :: Tests :: Camel IDE Project Integration Tests SUCCESS [ 10.294 s]
[INFO] JBoss Fuse Tooling :: Camel Editor :: Tests :: Project Templates Tests SUCCESS [ 1.968 s]
[INFO] JBoss Fuse Tooling :: Camel Editor :: Tests :: Project Templates Integration Tests FAILURE [19:00 min]
[INFO] JBoss Fuse Tooling :: Camel Editor :: Features ..... SUCCESS [ 0.013 s]
[INFO] JBoss Fuse Tooling :: Camel Editor :: Features :: Camel Editor Feature SUCCESS [ 0.249 s]
[INFO] JBoss Fuse Tooling :: Data Transformation .......... SUCCESS [ 0.009 s]
[INFO] JBoss Fuse Tooling :: Data Transformation :: Plugins SUCCESS [ 0.009 s]
[INFO] JBoss Fuse Tooling :: Data Transformation :: Plugins :: Core SUCCESS [ 2.124 s]
[INFO] JBoss Fuse Tooling :: Data Transformation :: Plugins :: Editor SUCCESS [ 0.886 s]
[INFO] JBoss Fuse Tooling :: Data Transformation :: Features SUCCESS [ 0.011 s]
[INFO] JBoss Fuse Tooling :: Data Transformation :: Features :: Data Transformation Feature SUCCESS [ 0.218 s]
[INFO] JBoss Fuse Tooling :: Core Transformation :: Tests . SUCCESS [ 0.010 s]
[INFO] JBoss Fuse Tooling :: Core Transformation :: Tests :: Core Transformation Tests SUCCESS [ 3.004 s]
[INFO] JBoss Fuse Tooling :: Core Transformation :: Tests :: Core Transformation Integration Tests SUCCESS [ 9.710 s]
[INFO] JBoss Fuse Tooling :: Editor Transformation :: Tests :: Editor Transformation Tests SUCCESS [ 1.700 s]
[INFO] JBoss Fuse Tooling :: Transformation Editor :: Tests :: Transformation Editor Integration Tests SUCCESS [ 10.816 s]
[INFO] JBoss Fuse Tooling :: JMX :: Plugins :: Apache ActiveMQ Facade SUCCESS [ 11.306 s]
[INFO] JBoss Fuse Tooling :: JMX :: Plugins :: Apache Camel Facade SUCCESS [ 0.456 s]
[INFO] JBoss Fuse Tooling :: JMX :: Plugins :: JMX Diagram View SUCCESS [ 0.359 s]
[INFO] JBoss Fuse Tooling :: Server Adapters .............. SUCCESS [ 0.025 s]
[INFO] JBoss Fuse Tooling :: Server Adapters :: Plugins ... SUCCESS [ 0.008 s]
[INFO] JBoss Fuse Tooling :: Server Adapters :: Plugins :: Apache Karaf Adapter Core SUCCESS [ 0.478 s]
[INFO] JBoss Fuse Tooling :: JMX :: Plugins :: Apache Karaf Facade SUCCESS [ 0.410 s]
[INFO] JBoss Fuse Tooling :: JMX :: Tests ................. SUCCESS [ 0.010 s]
[INFO] JBoss Fuse Tooling :: JMX :: Tests ::Camel ......... SUCCESS [ 1.564 s]
[INFO] JBoss Fuse Tooling :: JMX :: Integration Tests :: Camel SUCCESS [ 7.495 s]
[INFO] JBoss Fuse Tooling :: JMX :: Tests :: Commons ...... SUCCESS [ 1.767 s]
[INFO] JBoss Fuse Tooling :: JMX :: Tests :: Diagram ::View SUCCESS [ 1.966 s]
[INFO] JBoss Fuse Tooling :: JMX :: Features .............. SUCCESS [ 0.014 s]
[INFO] JBoss Fuse Tooling :: Server Adapters :: Plugins :: Commons SUCCESS [ 0.278 s]
[INFO] JBoss Fuse Tooling :: Server Adapters :: Plugins :: Apache Karaf Adapter UI SUCCESS [ 0.433 s]
[INFO] JBoss Fuse Tooling :: Server Adapters :: Plugins :: JBoss Fuse Adapter Core SUCCESS [ 0.340 s]
[INFO] JBoss Fuse Tooling :: Server Adapters :: Plugins :: JBoss Fuse Adapter UI SUCCESS [ 0.348 s]
[INFO] JBoss Fuse Tooling :: Server Adapters :: Features .. SUCCESS [ 0.009 s]
[INFO] JBoss Fuse Tooling :: Server Adapters :: Features :: Server Adapters Feature SUCCESS [ 0.202 s]
[INFO] JBoss Fuse Tooling :: JMX :: Features :: JMX Feature SUCCESS [ 0.229 s]
[INFO] JBoss Fuse Tooling :: Server Adapters :: Tests ..... SUCCESS [ 0.010 s]
[INFO] JBoss Fuse Tooling :: Server Adapters :: Tests :: Karaf Core Tests SUCCESS [ 1.773 s]
[INFO] JBoss Fuse Tooling :: Server Adapters :: Tests :: Server Tests SUCCESS [ 9.943 s]
[INFO] JBoss Fuse Tooling :: Update Site .................. SUCCESS [ 9.741 s]
[INFO] ------------------------------------------------------------------------
[INFO] BUILD FAILURE
[INFO] ------------------------------------------------------------------------
[INFO] Total time: 38:56 min
[INFO] Finished at: 2017-03-21T06:50:15-04:00
[INFO] Final Memory: 323M/804M
[INFO] ------------------------------------------------------------------------
[ERROR] Failed to execute goal org.eclipse.tycho:tycho-surefire-plugin:0.26.0:test (default-test) on project org.fusesource.ide.projecttemplates.tests.integration: There are test failures.
[ERROR]
[ERROR] Please refer to <https://fusesource-jenkins-rhel7.rhev-ci-vms.eng.rdu2.redhat.com/job/Fuse...> for the individual test results.
[ERROR] -> [Help 1]
[ERROR]
[ERROR] To see the full stack trace of the errors, re-run Maven with the -e switch.
[ERROR] Re-run Maven using the -X switch to enable full debug logging.
[ERROR]
[ERROR] For more information about the errors and possible solutions, please read the following articles:
[ERROR] [Help 1] http://cwiki.apache.org/confluence/display/MAVEN/MojoFailureException
[ERROR]
[ERROR] After correcting the problems, you can resume the build with the command
[ERROR] mvn <goals> -rf :org.fusesource.ide.projecttemplates.tests.integration
Build step 'Invoke top-level Maven targets' marked build as failure
Terminating xvnc.
$ vncserver -kill :95
Killing Xvnc process ID 4209
Archiving artifacts
Recording test results
7 years, 11 months
Build failed in Jenkins: Fuse-Tooling-pullrequest #1021
by Fuse Infra Team
See <https://fusesource-jenkins-rhel7.rhev-ci-vms.eng.rdu2.redhat.com/job/Fuse...>
Changes:
[Aurelien Pupier] FUSETOOLS-2327 - Add back CXF Code first template
[Aurelien Pupier] FUSETOOLS-2320 - Improve Camel Debug status in Debug View
[Aurelien Pupier] FUSETOOLS-2236 - Avoid NPE when there are Linked resource in project
[Aurelien Pupier] Include *IT classes as Test sources
------------------------------------------
[...truncated 48301 lines...]
testKaraf[0](org.fusesource.ide.server.tests.bean.KarafServerBean3xIT) Time elapsed: 0.029 sec
Running org.fusesource.ide.server.tests.bean.FuseESBServerBean6xIT
Tests run: 2, Failures: 0, Errors: 0, Skipped: 0, Time elapsed: 0.006 sec - in org.fusesource.ide.server.tests.bean.FuseESBServerBean6xIT
testFuseESB[0](org.fusesource.ide.server.tests.bean.FuseESBServerBean6xIT) Time elapsed: 0.001 sec
testFuseESB[1](org.fusesource.ide.server.tests.bean.FuseESBServerBean6xIT) Time elapsed: 0.001 sec
Running org.fusesource.ide.server.tests.bean.KarafServerBean2xIT
Tests run: 2, Failures: 0, Errors: 0, Skipped: 0, Time elapsed: 0.005 sec - in org.fusesource.ide.server.tests.bean.KarafServerBean2xIT
testKaraf[0](org.fusesource.ide.server.tests.bean.KarafServerBean2xIT) Time elapsed: 0.002 sec
testKaraf[1](org.fusesource.ide.server.tests.bean.KarafServerBean2xIT) Time elapsed: 0.001 sec
Running org.fusesource.ide.server.tests.locator.KarafRuntime2xLocatorIT
Tests run: 2, Failures: 0, Errors: 0, Skipped: 0, Time elapsed: 0.03 sec - in org.fusesource.ide.server.tests.locator.KarafRuntime2xLocatorIT
testKaraf[0](org.fusesource.ide.server.tests.locator.KarafRuntime2xLocatorIT) Time elapsed: 0.022 sec
testKaraf[1](org.fusesource.ide.server.tests.locator.KarafRuntime2xLocatorIT) Time elapsed: 0.004 sec
Running org.fusesource.ide.server.tests.locator.KarafRuntime3xLocatorIT
Tests run: 1, Failures: 0, Errors: 0, Skipped: 0, Time elapsed: 0.01 sec - in org.fusesource.ide.server.tests.locator.KarafRuntime3xLocatorIT
testKaraf[0](org.fusesource.ide.server.tests.locator.KarafRuntime3xLocatorIT) Time elapsed: 0.008 sec
Running org.fusesource.ide.server.tests.locator.FuseESBRuntime6xLocatorIT
Tests run: 2, Failures: 0, Errors: 0, Skipped: 0, Time elapsed: 0.013 sec - in org.fusesource.ide.server.tests.locator.FuseESBRuntime6xLocatorIT
testFuseESB[0](org.fusesource.ide.server.tests.locator.FuseESBRuntime6xLocatorIT) Time elapsed: 0.007 sec
testFuseESB[1](org.fusesource.ide.server.tests.locator.FuseESBRuntime6xLocatorIT) Time elapsed: 0.004 sec
Results :
Tests run: 10, Failures: 0, Errors: 0, Skipped: 0
[INFO] All tests passed!
[INFO]
[INFO] --- jacoco-maven-plugin:0.7.9:report (jacoco-site) @ org.fusesource.ide.server.tests ---
[INFO] Skipping JaCoCo execution due to missing execution data file.
[INFO]
[INFO] --- tycho-p2-extras-plugin:0.26.0:compare-version-with-baselines (default) @ org.fusesource.ide.server.tests ---
[INFO]
[INFO] ------------------------------------------------------------------------
[INFO] Building JBoss Fuse Tooling :: Update Site 9.2.0-SNAPSHOT
[INFO] ------------------------------------------------------------------------
[INFO]
[INFO] --- maven-clean-plugin:3.0.0:clean (default-clean) @ org.fusesource.ide.updatesite ---
[INFO]
[INFO] --- tycho-packaging-plugin:0.26.0:build-qualifier-aggregator (default-build-qualifier-aggregator) @ org.fusesource.ide.updatesite ---
[INFO] The project's OSGi version is 9.2.0.v20170320-1633
[INFO]
[INFO] --- build-helper-maven-plugin:1.7:regex-property (regex-property) @ org.fusesource.ide.updatesite ---
[INFO] Setting property 'skipTestsOrITests' to ''.
[INFO]
[INFO] --- maven-enforcer-plugin:1.4.1:enforce (core-has-ui-deps) @ org.fusesource.ide.updatesite ---
[INFO]
[INFO] --- maven-enforcer-plugin:1.4.1:enforce (warn-no-snapshots-AMx) @ org.fusesource.ide.updatesite ---
[ERROR] Found property update.site.version = 9.2.0-SNAPSHOT.LOCAL
[INFO]
[INFO] --- maven-enforcer-plugin:1.4.1:enforce (enforce-no-snapshots-Final) @ org.fusesource.ide.updatesite ---
[ERROR] Found property update.site.version = 9.2.0-SNAPSHOT.LOCAL
[INFO]
[INFO] --- maven-clean-plugin:3.0.0:clean (default-clean-1) @ org.fusesource.ide.updatesite ---
[INFO]
[INFO] --- jacoco-maven-plugin:0.7.9:prepare-agent (default) @ org.fusesource.ide.updatesite ---
[INFO] argLine set to -javaagent:<https://fusesource-jenkins-rhel7.rhev-ci-vms.eng.rdu2.redhat.com/job/Fuse...>
[INFO]
[INFO] --- jacoco-maven-plugin:0.7.9:prepare-agent (agent-for-ut) @ org.fusesource.ide.updatesite ---
[INFO] argLine set to -javaagent:<https://fusesource-jenkins-rhel7.rhev-ci-vms.eng.rdu2.redhat.com/job/Fuse...>:org.jboss.tools.fuse.*
[INFO]
[INFO] --- maven-resources-plugin:2.7:resources (default-resources) @ org.fusesource.ide.updatesite ---
[INFO] Using 'UTF-8' encoding to copy filtered resources.
[INFO] skip non existing resourceDirectory <https://fusesource-jenkins-rhel7.rhev-ci-vms.eng.rdu2.redhat.com/job/Fuse...>
[INFO]
[INFO] --- maven-compiler-plugin:3.5.1:testCompile (compiletests) @ org.fusesource.ide.updatesite ---
[INFO] No sources to compile
[INFO]
[INFO] --- maven-surefire-plugin:2.19.1:test (test) @ org.fusesource.ide.updatesite ---
[INFO] No tests to run.
[INFO]
[INFO] --- tycho-source-plugin:0.26.0:plugin-source (plugin-source) @ org.fusesource.ide.updatesite ---
[INFO]
[INFO] --- target-platform-configuration:0.26.0:target-platform (default-target-platform) @ org.fusesource.ide.updatesite ---
[INFO]
[INFO] --- tycho-p2-publisher-plugin:0.26.0:publish-products (default-publish-products) @ org.fusesource.ide.updatesite ---
[INFO]
[INFO] --- tycho-p2-publisher-plugin:0.26.0:publish-categories (default-publish-categories) @ org.fusesource.ide.updatesite ---
[INFO]
[INFO] --- tycho-p2-publisher-plugin:0.26.0:attach-artifacts (default-attach-artifacts) @ org.fusesource.ide.updatesite ---
[INFO]
[INFO] --- tycho-p2-repository-plugin:0.26.0:assemble-repository (default-assemble-repository) @ org.fusesource.ide.updatesite ---
[INFO]
[INFO] --- tycho-p2-repository-plugin:0.26.0:archive-repository (default-archive-repository) @ org.fusesource.ide.updatesite ---
[INFO] Building zip: <https://fusesource-jenkins-rhel7.rhev-ci-vms.eng.rdu2.redhat.com/job/Fuse...>
[INFO]
[INFO] --- tycho-source-feature-plugin:0.26.0:source-feature (source-feature) @ org.fusesource.ide.updatesite ---
[INFO]
[INFO] --- tycho-p2-plugin:0.26.0:p2-metadata (attached-p2-metadata) @ org.fusesource.ide.updatesite ---
[INFO]
[INFO] --- repository-utils:0.26.0:generate-repository-facade (generate-facade) @ org.fusesource.ide.updatesite ---
[INFO] Building zip: <https://fusesource-jenkins-rhel7.rhev-ci-vms.eng.rdu2.redhat.com/job/Fuse...>
[INFO]
[INFO] --- jacoco-maven-plugin:0.7.9:prepare-agent-integration (agent-for-it) @ org.fusesource.ide.updatesite ---
[INFO] argLine set to -javaagent:<https://fusesource-jenkins-rhel7.rhev-ci-vms.eng.rdu2.redhat.com/job/Fuse...>:org.jboss.tools.fuse.*
[INFO]
[INFO] --- jacoco-maven-plugin:0.7.9:report (jacoco-site) @ org.fusesource.ide.updatesite ---
[INFO] Skipping JaCoCo execution due to missing execution data file.
[INFO]
[INFO] --- tycho-p2-extras-plugin:0.26.0:compare-version-with-baselines (default) @ org.fusesource.ide.updatesite ---
[INFO] ------------------------------------------------------------------------
[INFO] Reactor Summary:
[INFO]
[INFO] JBoss Fuse Tooling :: Build Configuration .......... SUCCESS [ 10.412 s]
[INFO] JBoss Fuse Tooling ................................. SUCCESS [ 24.568 s]
[INFO] JBoss Fuse Tooling :: Tools ........................ SUCCESS [ 0.012 s]
[INFO] JBoss Fuse Tooling :: Tools :: IDE Camel Catalog Generator SUCCESS [01:37 min]
[INFO] JBoss Fuse Tooling :: Core ......................... SUCCESS [ 0.014 s]
[INFO] JBoss Fuse Tooling :: Core :: Plugins .............. SUCCESS [ 0.010 s]
[INFO] JBoss Fuse Tooling :: Core :: Plugins :: Foundation Core SUCCESS [ 10.525 s]
[INFO] JBoss Fuse Tooling :: Core :: Plugins :: Preferences SUCCESS [ 0.194 s]
[INFO] JBoss Fuse Tooling :: Core :: Plugins :: Foundation UI SUCCESS [ 0.902 s]
[INFO] JBoss Fuse Tooling :: Core :: Plugins :: Camel Model Service API SUCCESS [ 9.794 s]
[INFO] JBoss Fuse Tooling :: Core :: Plugins :: Camel 2.15.1.redhat-621084 Service Implementation SUCCESS [ 2.314 s]
[INFO] JBoss Fuse Tooling :: Core :: Plugins :: Camel 2.15.1.redhat-621117 Service Implementation SUCCESS [ 1.962 s]
[INFO] JBoss Fuse Tooling :: Core :: Plugins :: Camel 2.17.0.redhat-630187 Service Implementation SUCCESS [ 18.077 s]
[INFO] JBoss Fuse Tooling :: Core :: Plugins :: Camel 2.17.0.redhat-630224 Service Implementation SUCCESS [ 17.934 s]
[INFO] JBoss Fuse Tooling :: Core :: Plugins :: Camel 2.17.3 Service Implementation SUCCESS [ 4.521 s]
[INFO] JBoss Fuse Tooling :: Core :: Plugins :: Camel 2.18.1.redhat-000012 Service Implementation SUCCESS [ 13.446 s]
[INFO] JBoss Fuse Tooling :: Core :: Plugins :: Maven ..... SUCCESS [ 0.286 s]
[INFO] JBoss Fuse Tooling :: Camel Editor ................. SUCCESS [ 0.013 s]
[INFO] JBoss Fuse Tooling :: Camel Editor :: Plugins ...... SUCCESS [ 0.011 s]
[INFO] JBoss Fuse Tooling :: Camel Editor :: Plugins :: Branding SUCCESS [ 0.539 s]
[INFO] JBoss Fuse Tooling :: Core :: Plugins :: Camel Validation SUCCESS [ 0.402 s]
[INFO] JBoss Fuse Tooling :: Core :: Plugins :: Cheat Sheets SUCCESS [ 0.103 s]
[INFO] JBoss Fuse Tooling :: Core :: Plugins :: Graph ..... SUCCESS [ 0.334 s]
[INFO] JBoss Fuse Tooling :: Core :: Plugins :: Help ...... SUCCESS [ 4.320 s]
[INFO] JBoss Fuse Tooling :: Core :: Plugins :: Imports ... SUCCESS [ 0.270 s]
[INFO] JBoss Fuse Tooling :: Core :: Plugins :: Branding .. SUCCESS [ 0.088 s]
[INFO] JBoss Fuse Tooling :: Core :: Tests ................ SUCCESS [ 0.008 s]
[INFO] JBoss Fuse Tooling :: Core :: Tests :: Camel Service Core Tests SUCCESS [ 3.113 s]
[INFO] JBoss Fuse Tooling :: JMX .......................... SUCCESS [ 0.011 s]
[INFO] JBoss Fuse Tooling :: JMX :: Plugins ............... SUCCESS [ 0.008 s]
[INFO] JBoss Fuse Tooling :: JMX :: Plugins :: JMX Commons SUCCESS [ 0.395 s]
[INFO] JBoss Fuse Tooling :: Camel Editor :: Plugins :: Launcher SUCCESS [ 0.412 s]
[INFO] JBoss Fuse Tooling :: Camel Editor :: Plugins :: Camel Editor SUCCESS [ 1.004 s]
[INFO] JBoss Fuse Tooling :: Core :: Tests :: Camel Service Core Integration Tests SUCCESS [ 37.244 s]
[INFO] JBoss Fuse Tooling :: Core :: Tests :: Camel Model Tests SUCCESS [ 8.198 s]
[INFO] JBoss Fuse Tooling :: Core :: Tests :: Camel Validation Integration Tests SUCCESS [ 0.522 s]
[INFO] JBoss Fuse Tooling :: Core :: Tests :: Camel Validation Tests SUCCESS [ 1.687 s]
[INFO] JBoss Fuse Tooling :: Camel Editor :: Plugins :: Project SUCCESS [ 0.491 s]
[INFO] JBoss Fuse Tooling :: Camel Editor :: Plugins :: Project Templates SUCCESS [ 3.194 s]
[INFO] JBoss Fuse Tooling :: Camel Editor :: Tests ........ SUCCESS [ 0.008 s]
[INFO] JBoss Fuse Tooling :: Camel Editor :: Tests :: Camel Editor Integration Tests SUCCESS [05:37 min]
[INFO] JBoss Fuse Tooling :: Core :: Tests :: Camel Validation Integration Tests SUCCESS [ 15.857 s]
[INFO] JBoss Fuse Tooling :: Core :: Features ............. SUCCESS [ 0.010 s]
[INFO] JBoss Fuse Tooling :: Core :: Features :: Core Feature SUCCESS [ 0.305 s]
[INFO] JBoss Fuse Tooling :: Camel Editor :: Plugins :: XSD Catalogs SUCCESS [ 0.145 s]
[INFO] JBoss Fuse Tooling :: Camel Editor :: Plugins :: Launcher UI SUCCESS [ 0.366 s]
[INFO] JBoss Fuse Tooling :: Camel Editor :: Tests :: Camel Editor Tests SUCCESS [ 3.649 s]
[INFO] JBoss Fuse Tooling :: Camel Editor :: Tests :: Camel IDE Launcher Tests SUCCESS [ 1.992 s]
[INFO] JBoss Fuse Tooling :: Camel Editor :: Tests :: Launcher UI Tests SUCCESS [ 1.924 s]
[INFO] JBoss Fuse Tooling :: Camel Editor :: Tests :: Camel IDE Launcher UI Integration Tests SUCCESS [ 8.608 s]
[INFO] JBoss Fuse Tooling :: Camel Editor :: Tests :: Camel IDE Project Integration Tests SUCCESS [ 9.553 s]
[INFO] JBoss Fuse Tooling :: Camel Editor :: Tests :: Project Templates Tests SUCCESS [ 1.955 s]
[INFO] JBoss Fuse Tooling :: Camel Editor :: Tests :: Project Templates Integration Tests FAILURE [18:51 min]
[INFO] JBoss Fuse Tooling :: Camel Editor :: Features ..... SUCCESS [ 0.008 s]
[INFO] JBoss Fuse Tooling :: Camel Editor :: Features :: Camel Editor Feature SUCCESS [ 0.232 s]
[INFO] JBoss Fuse Tooling :: Data Transformation .......... SUCCESS [ 0.008 s]
[INFO] JBoss Fuse Tooling :: Data Transformation :: Plugins SUCCESS [ 0.008 s]
[INFO] JBoss Fuse Tooling :: Data Transformation :: Plugins :: Core SUCCESS [ 2.070 s]
[INFO] JBoss Fuse Tooling :: Data Transformation :: Plugins :: Editor SUCCESS [ 0.833 s]
[INFO] JBoss Fuse Tooling :: Data Transformation :: Features SUCCESS [ 0.009 s]
[INFO] JBoss Fuse Tooling :: Data Transformation :: Features :: Data Transformation Feature SUCCESS [ 0.223 s]
[INFO] JBoss Fuse Tooling :: Core Transformation :: Tests . SUCCESS [ 0.008 s]
[INFO] JBoss Fuse Tooling :: Core Transformation :: Tests :: Core Transformation Tests SUCCESS [ 2.929 s]
[INFO] JBoss Fuse Tooling :: Core Transformation :: Tests :: Core Transformation Integration Tests SUCCESS [ 9.500 s]
[INFO] JBoss Fuse Tooling :: Editor Transformation :: Tests :: Editor Transformation Tests SUCCESS [ 1.667 s]
[INFO] JBoss Fuse Tooling :: Transformation Editor :: Tests :: Transformation Editor Integration Tests SUCCESS [ 10.309 s]
[INFO] JBoss Fuse Tooling :: JMX :: Plugins :: Apache ActiveMQ Facade SUCCESS [ 3.388 s]
[INFO] JBoss Fuse Tooling :: JMX :: Plugins :: Apache Camel Facade SUCCESS [ 0.487 s]
[INFO] JBoss Fuse Tooling :: JMX :: Plugins :: JMX Diagram View SUCCESS [ 0.361 s]
[INFO] JBoss Fuse Tooling :: Server Adapters .............. SUCCESS [ 0.008 s]
[INFO] JBoss Fuse Tooling :: Server Adapters :: Plugins ... SUCCESS [ 0.008 s]
[INFO] JBoss Fuse Tooling :: Server Adapters :: Plugins :: Apache Karaf Adapter Core SUCCESS [ 0.429 s]
[INFO] JBoss Fuse Tooling :: JMX :: Plugins :: Apache Karaf Facade SUCCESS [ 0.393 s]
[INFO] JBoss Fuse Tooling :: JMX :: Tests ................. SUCCESS [ 0.007 s]
[INFO] JBoss Fuse Tooling :: JMX :: Tests ::Camel ......... SUCCESS [ 1.556 s]
[INFO] JBoss Fuse Tooling :: JMX :: Integration Tests :: Camel SUCCESS [ 7.294 s]
[INFO] JBoss Fuse Tooling :: JMX :: Tests :: Commons ...... SUCCESS [ 1.636 s]
[INFO] JBoss Fuse Tooling :: JMX :: Tests :: Diagram ::View SUCCESS [ 1.808 s]
[INFO] JBoss Fuse Tooling :: JMX :: Features .............. SUCCESS [ 0.007 s]
[INFO] JBoss Fuse Tooling :: Server Adapters :: Plugins :: Commons SUCCESS [ 0.240 s]
[INFO] JBoss Fuse Tooling :: Server Adapters :: Plugins :: Apache Karaf Adapter UI SUCCESS [ 0.519 s]
[INFO] JBoss Fuse Tooling :: Server Adapters :: Plugins :: JBoss Fuse Adapter Core SUCCESS [ 0.317 s]
[INFO] JBoss Fuse Tooling :: Server Adapters :: Plugins :: JBoss Fuse Adapter UI SUCCESS [ 0.351 s]
[INFO] JBoss Fuse Tooling :: Server Adapters :: Features .. SUCCESS [ 0.008 s]
[INFO] JBoss Fuse Tooling :: Server Adapters :: Features :: Server Adapters Feature SUCCESS [ 0.202 s]
[INFO] JBoss Fuse Tooling :: JMX :: Features :: JMX Feature SUCCESS [ 0.247 s]
[INFO] JBoss Fuse Tooling :: Server Adapters :: Tests ..... SUCCESS [ 0.010 s]
[INFO] JBoss Fuse Tooling :: Server Adapters :: Tests :: Karaf Core Tests SUCCESS [ 1.704 s]
[INFO] JBoss Fuse Tooling :: Server Adapters :: Tests :: Server Tests SUCCESS [ 9.682 s]
[INFO] JBoss Fuse Tooling :: Update Site .................. SUCCESS [ 9.606 s]
[INFO] ------------------------------------------------------------------------
[INFO] BUILD FAILURE
[INFO] ------------------------------------------------------------------------
[INFO] Total time: 40:00 min
[INFO] Finished at: 2017-03-21T04:50:27-04:00
[INFO] Final Memory: 380M/1686M
[INFO] ------------------------------------------------------------------------
[ERROR] Failed to execute goal org.eclipse.tycho:tycho-surefire-plugin:0.26.0:test (default-test) on project org.fusesource.ide.projecttemplates.tests.integration: There are test failures.
[ERROR]
[ERROR] Please refer to <https://fusesource-jenkins-rhel7.rhev-ci-vms.eng.rdu2.redhat.com/job/Fuse...> for the individual test results.
[ERROR] -> [Help 1]
org.apache.maven.lifecycle.LifecycleExecutionException: Failed to execute goal org.eclipse.tycho:tycho-surefire-plugin:0.26.0:test (default-test) on project org.fusesource.ide.projecttemplates.tests.integration: There are test failures.
Please refer to <https://fusesource-jenkins-rhel7.rhev-ci-vms.eng.rdu2.redhat.com/job/Fuse...> for the individual test results.
at org.apache.maven.lifecycle.internal.MojoExecutor.execute(MojoExecutor.java:212)
at org.apache.maven.lifecycle.internal.MojoExecutor.execute(MojoExecutor.java:153)
at org.apache.maven.lifecycle.internal.MojoExecutor.execute(MojoExecutor.java:145)
at org.apache.maven.lifecycle.internal.LifecycleModuleBuilder.buildProject(LifecycleModuleBuilder.java:116)
at org.apache.maven.lifecycle.internal.LifecycleModuleBuilder.buildProject(LifecycleModuleBuilder.java:80)
at org.apache.maven.lifecycle.internal.builder.singlethreaded.SingleThreadedBuilder.build(SingleThreadedBuilder.java:51)
at org.apache.maven.lifecycle.internal.LifecycleStarter.execute(LifecycleStarter.java:128)
at org.apache.maven.DefaultMaven.doExecute(DefaultMaven.java:307)
at org.apache.maven.DefaultMaven.doExecute(DefaultMaven.java:193)
at org.apache.maven.DefaultMaven.execute(DefaultMaven.java:106)
at org.apache.maven.cli.MavenCli.execute(MavenCli.java:863)
at org.apache.maven.cli.MavenCli.doMain(MavenCli.java:288)
at org.apache.maven.cli.MavenCli.main(MavenCli.java:199)
at sun.reflect.NativeMethodAccessorImpl.invoke0(Native Method)
at sun.reflect.NativeMethodAccessorImpl.invoke(NativeMethodAccessorImpl.java:62)
at sun.reflect.DelegatingMethodAccessorImpl.invoke(DelegatingMethodAccessorImpl.java:43)
at java.lang.reflect.Method.invoke(Method.java:498)
at org.codehaus.plexus.classworlds.launcher.Launcher.launchEnhanced(Launcher.java:289)
at org.codehaus.plexus.classworlds.launcher.Launcher.launch(Launcher.java:229)
at org.codehaus.plexus.classworlds.launcher.Launcher.mainWithExitCode(Launcher.java:415)
at org.codehaus.plexus.classworlds.launcher.Launcher.main(Launcher.java:356)
Caused by: org.apache.maven.plugin.MojoFailureException: There are test failures.
Please refer to <https://fusesource-jenkins-rhel7.rhev-ci-vms.eng.rdu2.redhat.com/job/Fuse...> for the individual test results.
at org.eclipse.tycho.surefire.TestMojo.runTest(TestMojo.java:998)
at org.eclipse.tycho.surefire.TestMojo.execute(TestMojo.java:666)
at org.apache.maven.plugin.DefaultBuildPluginManager.executeMojo(DefaultBuildPluginManager.java:134)
at org.apache.maven.lifecycle.internal.MojoExecutor.execute(MojoExecutor.java:207)
... 20 more
[ERROR]
[ERROR] Re-run Maven using the -X switch to enable full debug logging.
[ERROR]
[ERROR] For more information about the errors and possible solutions, please read the following articles:
[ERROR] [Help 1] http://cwiki.apache.org/confluence/display/MAVEN/MojoFailureException
[ERROR]
[ERROR] After correcting the problems, you can resume the build with the command
[ERROR] mvn <goals> -rf :org.fusesource.ide.projecttemplates.tests.integration
Build step 'Invoke top-level Maven targets' marked build as failure
Terminating xvnc.
$ vncserver -kill :95
Killing Xvnc process ID 3033
Archiving artifacts
Recording test results
7 years, 11 months