See <
http://jenkins.mw.lab.eng.bos.redhat.com/hudson/job/Errai/1204/changes>
Changes:
[mbarkley] Fixed @Service annotation on private methods in Bus implementation
[mbarkley] Fixed bus implementation with @Command on private methods
[max.barkley] Fixed local subscriptions from being subscribed remotely
[max.barkley] ERRAI-618: Reduced code duplication of @Service and @Command features
[max.barkley] Added more tests for @Service and @Command annotations.
------------------------------------------
[...truncated 2691 lines...]
Uploaded:
https://repository.jboss.org/nexus/content/repositories/snapshots/org/jbo...
(996 B at 0.7 KB/sec)
mojoSucceeded org.apache.maven.plugins:maven-deploy-plugin:2.7(default-deploy)
projectSucceeded org.jboss.errai:errai-marshalling:3.0-SNAPSHOT
projectStarted org.jboss.errai:errai-bus:3.0-SNAPSHOT
[INFO]
[INFO] ------------------------------------------------------------------------
[INFO] Building Errai::Bus 3.0-SNAPSHOT
[INFO] ------------------------------------------------------------------------
mojoStarted org.apache.maven.plugins:maven-clean-plugin:2.4.1(default-clean)
[INFO]
[INFO] --- maven-clean-plugin:2.4.1:clean (default-clean) @ errai-bus ---
[INFO] Deleting
<
http://jenkins.mw.lab.eng.bos.redhat.com/hudson/job/Errai/ws/errai-bus/ta...
[INFO] Deleting
<
http://jenkins.mw.lab.eng.bos.redhat.com/hudson/job/Errai/ws/errai-bus> (includes =
[www-test/**, .gwt/**, .errai/**, war/WEB-INF/deploy/**, war/WEB-INF/lib/**,
war/WEB-INF/classes/**, src/main/webapp/WEB-INF/deploy/**, src/main/webapp/WEB-INF/lib/**,
src/main/webapp/WEB-INF/classes/**, **/gwt-unitCache/**, **/*.JUnit/**], excludes = [])
mojoSucceeded org.apache.maven.plugins:maven-clean-plugin:2.4.1(default-clean)
mojoStarted org.apache.maven.plugins:maven-enforcer-plugin:1.2(enforce-sane-versions)
[INFO]
[INFO] --- maven-enforcer-plugin:1.2:enforce (enforce-sane-versions) @ errai-bus ---
mojoSucceeded org.apache.maven.plugins:maven-enforcer-plugin:1.2(enforce-sane-versions)
mojoStarted org.jboss.errai:jacoco-gwt-maven-plugin:0.5.4.201202141554(jacoco-initialize)
[INFO]
[INFO] [INFO] jacocoArgs set to
-javaagent:/home/hudson/.m2/repository/org/jboss/errai/jacoco-gwt-maven-plugin/0.5.4.201202141554/jacoco-gwt-maven-plugin-0.5.4.201202141554.jar=snapshotDirectory=<http://jenkins.mw.lab.eng.bos.redhat.com/hudson/job/Errai/ws/errai-bus/target/snapshot-classes,snapshotClassLoaders=*gwt*>
-javaagent:/home/hudson/.m2/repository/org/jacoco/org.jacoco.agent/0.5.4.201111111111/org.jacoco.agent-0.5.4.201111111111-runtime.jar=destfile=<http://jenkins.mw.lab.eng.bos.redhat.com/hudson/job/Errai/ws/errai-bus/target/jacoco.exec>
--- jacoco-gwt-maven-plugin:0.5.4.201202141554:prepare-agent (jacoco-initialize) @
errai-bus ---
mojoSucceeded
org.jboss.errai:jacoco-gwt-maven-plugin:0.5.4.201202141554(jacoco-initialize)
[INFO] Using 'UTF-8' encoding to copy filtered resources.
mojoStarted org.apache.maven.plugins:maven-resources-plugin:2.6(default-resources)
[INFO]
[INFO] --- maven-resources-plugin:2.6:resources (default-resources) @ errai-bus ---
[INFO] Copying 259 resources
[INFO] skip non existing resourceDirectory
<
http://jenkins.mw.lab.eng.bos.redhat.com/hudson/job/Errai/ws/errai-bus/sr...
mojoSucceeded org.apache.maven.plugins:maven-resources-plugin:2.6(default-resources)
mojoStarted org.apache.maven.plugins:maven-compiler-plugin:2.3.2(default-compile)
[INFO]
[INFO] --- maven-compiler-plugin:2.3.2:compile (default-compile) @ errai-bus ---
[INFO] Compiling 254 source files to
<
http://jenkins.mw.lab.eng.bos.redhat.com/hudson/job/Errai/ws/errai-bus/ta...
mojoSucceeded org.apache.maven.plugins:maven-compiler-plugin:2.3.2(default-compile)
mojoStarted
org.apache.maven.plugins:maven-resources-plugin:2.6(default-testResources)[INFO] Using
'UTF-8' encoding to copy filtered resources.
[INFO] Copying 151 resources
[INFO]
[INFO] --- maven-resources-plugin:2.6:testResources (default-testResources) @ errai-bus
---
[INFO] Copying 6 resources
mojoSucceeded org.apache.maven.plugins:maven-resources-plugin:2.6(default-testResources)
mojoStarted org.apache.maven.plugins:maven-compiler-plugin:2.3.2(default-testCompile)
[INFO]
[INFO] --- maven-compiler-plugin:2.3.2:testCompile (default-testCompile) @ errai-bus ---
[INFO] Compiling 148 source files to
<
http://jenkins.mw.lab.eng.bos.redhat.com/hudson/job/Errai/ws/errai-bus/ta...
[INFO] -------------------------------------------------------------
mojoFailed org.apache.maven.plugins:maven-compiler-plugin:2.3.2(default-testCompile)
[ERROR] COMPILATION ERROR :
[INFO] -------------------------------------------------------------
[ERROR]
<
http://jenkins.mw.lab.eng.bos.redhat.com/hudson/job/Errai/ws/errai-bus/sr...
testClassWithServiceAndMethodWithService1() is already defined in
org.jboss.errai.bus.client.tests.ServiceAnnotationTests
[ERROR]
<
http://jenkins.mw.lab.eng.bos.redhat.com/hudson/job/Errai/ws/errai-bus/sr...
testClassWithServiceAndMethodWithService2() is already defined in
org.jboss.errai.bus.client.tests.ServiceAnnotationTests
[ERROR]
<
http://jenkins.mw.lab.eng.bos.redhat.com/hudson/job/Errai/ws/errai-bus/sr...
testClassWithServiceAndMethodWithServiceAndCommand1() is already defined in
org.jboss.errai.bus.client.tests.ServiceAnnotationTests
[ERROR]
<
http://jenkins.mw.lab.eng.bos.redhat.com/hudson/job/Errai/ws/errai-bus/sr...
testClassWithServiceAndMethodWithServiceAndCommand2() is already defined in
org.jboss.errai.bus.client.tests.ServiceAnnotationTests
[ERROR]
<
http://jenkins.mw.lab.eng.bos.redhat.com/hudson/job/Errai/ws/errai-bus/sr...
testClassWithServiceAndMethodWithService1() is already defined in
org.jboss.errai.bus.client.tests.ServiceAnnotationTests
[ERROR]
<
http://jenkins.mw.lab.eng.bos.redhat.com/hudson/job/Errai/ws/errai-bus/sr...
testClassWithServiceAndMethodWithService2() is already defined in
org.jboss.errai.bus.client.tests.ServiceAnnotationTests
[ERROR]
<
http://jenkins.mw.lab.eng.bos.redhat.com/hudson/job/Errai/ws/errai-bus/sr...
testClassWithServiceAndMethodWithServiceAndCommand1() is already defined in
org.jboss.errai.bus.client.tests.ServiceAnnotationTests
[ERROR]
<
http://jenkins.mw.lab.eng.bos.redhat.com/hudson/job/Errai/ws/errai-bus/sr...
testClassWithServiceAndMethodWithServiceAndCommand2() is already defined in
org.jboss.errai.bus.client.tests.ServiceAnnotationTests
[ERROR]
<
http://jenkins.mw.lab.eng.bos.redhat.com/hudson/job/Errai/ws/errai-bus/sr...
runServiceTest(java.lang.String,java.lang.String,java.lang.String) in
org.jboss.errai.bus.client.tests.ServiceAnnotationTests cannot be applied to
(java.lang.String,<nulltype>)
[ERROR]
<
http://jenkins.mw.lab.eng.bos.redhat.com/hudson/job/Errai/ws/errai-bus/sr...
runServiceTest(java.lang.String,java.lang.String,java.lang.String) in
org.jboss.errai.bus.client.tests.ServiceAnnotationTests cannot be applied to
(java.lang.String,<nulltype>)
[ERROR]
<
http://jenkins.mw.lab.eng.bos.redhat.com/hudson/job/Errai/ws/errai-bus/sr...
runServiceTest(java.lang.String,java.lang.String,java.lang.String) in
org.jboss.errai.bus.client.tests.ServiceAnnotationTests cannot be applied to
(java.lang.String,java.lang.String)
[ERROR]
<
http://jenkins.mw.lab.eng.bos.redhat.com/hudson/job/Errai/ws/errai-bus/sr...
runServiceTestAndThen(java.lang.String,java.lang.String,java.lang.String,java.lang.Runnable)
in org.jboss.errai.bus.client.tests.ServiceAnnotationTests cannot be applied to
(java.lang.String,java.lang.String,<anonymous java.lang.Runnable>)
[INFO] 12 errors
[INFO] -------------------------------------------------------------
projectFailed org.jboss.errai:errai-bus:3.0-SNAPSHOT
sessionEnded
[INFO] ------------------------------------------------------------------------
[INFO] Reactor Summary:
[INFO]
[INFO] Errai version master BOM .......................... SUCCESS [13.756s]
[INFO] Errai ............................................. SUCCESS [15.618s]
[INFO] Reflections parent ................................ SUCCESS [10.368s]
[INFO] Reflections ....................................... SUCCESS [45.666s]
[INFO] Errai::Common ..................................... SUCCESS [26.577s]
[INFO] Errai::CDI::EE6 API Overrides ..................... SUCCESS [12.439s]
[INFO] Errai::Codegen .................................... SUCCESS [48.379s]
[INFO] Errai::Codegen::GWT ............................... SUCCESS [23.804s]
[INFO] Errai::Config ..................................... SUCCESS [15.704s]
[INFO] Errai::Marshalling ................................ SUCCESS [35.820s]
[INFO] Errai::Bus ........................................ FAILURE [34.310s]
[INFO] Errai::Tools ...................................... SKIPPED
[INFO] Errai::IOC ........................................ SKIPPED
[INFO] Errai::JS ......................................... SKIPPED
[INFO] Errai::CDI ........................................ SKIPPED
[INFO] Errai::CDI::Jetty ................................. SKIPPED
[INFO] Errai::IOC::Bus Support ........................... SKIPPED
[INFO] Errai::CDI::Client ................................ SKIPPED
[INFO] Errai::Data::Binding .............................. SKIPPED
[INFO] Errai::CDI::Weld Integration ...................... SKIPPED
[INFO] Errai::JAX-RS ..................................... SKIPPED
[INFO] Errai::JAX-RS::Provider ........................... SKIPPED
[INFO] Errai::JAX-RS::Client ............................. SKIPPED
[INFO] Errai::UI ......................................... SKIPPED
[INFO] Errai::Navigation ................................. SKIPPED
[INFO] Errai::UI::Binder ................................. SKIPPED
[INFO] Errai::Validation ................................. SKIPPED
[INFO] Errai::JPA ........................................ SKIPPED
[INFO] Errai::JPA::Client ................................ SKIPPED
[INFO] Errai::JPA::Data Synchronization .................. SKIPPED
[INFO] Errai::HTML5 ...................................... SKIPPED
[INFO] Errai::Java EE::All ............................... SKIPPED
[INFO] errai-ioc-async-tests ............................. SKIPPED
[INFO] errai-cdi-async-tests ............................. SKIPPED
[INFO] Errai::Cordova .................................... SKIPPED
[INFO] Errai::Cordova::Maven Plugin ...................... SKIPPED
[INFO] errai-bus-jboss7-websocket ........................ SKIPPED
[INFO] errai-jboss-as-support ............................ SKIPPED
[INFO] errai-otec ........................................ SKIPPED
[INFO] Errai::Security ................................... SKIPPED
[INFO] errai-cdi-async-databinding-tests ................. SKIPPED
[INFO] JBoss Errai BOM ................................... SKIPPED
[INFO] Errai::Bus::Demos::StressTest ..................... SKIPPED
[INFO] Errai::Bus::Demos::Stock .......................... SKIPPED
[INFO] Errai::CDI::Demos::Mobile ......................... SKIPPED
[INFO] Errai::CDI::Demos::MVP ............................ SKIPPED
[INFO] Errai::CDI::Demos::TagCloud ....................... SKIPPED
[INFO] Errai::JPA::Demos::Basic .......................... SKIPPED
[INFO] Errai::JPA::Demos::GroceryList .................... SKIPPED
[INFO] Errai::JPA::Demos::ToDoList ....................... SKIPPED
[INFO] Errai::JAX-RS::RestDemo ........................... SKIPPED
[INFO] Errai::UI::Demos::I18NDemo ........................ SKIPPED
[INFO] Errai::Cordova::Demos::Aerogear ................... SKIPPED
[INFO] Errai::Demos::Aggregator .......................... SKIPPED
[INFO] Errai::Reference::Guide ........................... SKIPPED
[INFO] Errai::Quickstart::Guide .......................... SKIPPED
[INFO] Errai::Distribution ............................... SKIPPED
[INFO] ------------------------------------------------------------------------
[INFO] BUILD FAILURE
[INFO] ------------------------------------------------------------------------
[INFO] Total time: 4:56.306s
[INFO] Finished at: Wed Oct 02 17:07:23 EDT 2013
[INFO] Final Memory: 141M/579M
[INFO] ------------------------------------------------------------------------
Projects to build: [MavenProject: org.jboss.errai.bom:errai-version-master:3.0-SNAPSHOT @
<
http://jenkins.mw.lab.eng.bos.redhat.com/hudson/job/Errai/ws/errai-versio...
MavenProject: org.jboss.errai:errai-parent:3.0-SNAPSHOT @
<
http://jenkins.mw.lab.eng.bos.redhat.com/hudson/job/Errai/ws/pom.xml,>
MavenProject: org.jboss.errai.reflections:reflections-parent:3.0-SNAPSHOT @
<
http://jenkins.mw.lab.eng.bos.redhat.com/hudson/job/Errai/ws/errai-reflec...
MavenProject: org.jboss.errai.reflections:reflections:3.0-SNAPSHOT @
<
http://jenkins.mw.lab.eng.bos.redhat.com/hudson/job/Errai/ws/errai-reflec...
MavenProject: org.jboss.errai:errai-common:3.0-SNAPSHOT @
<
http://jenkins.mw.lab.eng.bos.redhat.com/hudson/job/Errai/ws/errai-common...
MavenProject: org.jboss.errai:errai-javax-enterprise:3.0-SNAPSHOT @
<
http://jenkins.mw.lab.eng.bos.redhat.com/hudson/job/Errai/ws/errai-javax-...
MavenProject: org.jboss.errai:errai-codegen:3.0-SNAPSHOT @
<
http://jenkins.mw.lab.eng.bos.redhat.com/hudson/job/Errai/ws/errai-codege...
MavenProject: org.jboss.errai:errai-codegen-gwt:3.0-SNAPSHOT @
<
http://jenkins.mw.lab.eng.bos.redhat.com/hudson/job/Errai/ws/errai-codege...
MavenProject: org.jboss.errai:errai-config:3.0-SNAPSHOT @
<
http://jenkins.mw.lab.eng.bos.redhat.com/hudson/job/Errai/ws/errai-config...
MavenProject: org.jboss.errai:errai-marshalling:3.0-SNAPSHOT @
<
http://jenkins.mw.lab.eng.bos.redhat.com/hudson/job/Errai/ws/errai-marsha...
MavenProject: org.jboss.errai:errai-bus:3.0-SNAPSHOT @
<
http://jenkins.mw.lab.eng.bos.redhat.com/hudson/job/Errai/ws/errai-bus/po...
MavenProject: org.jboss.errai:errai-tools:3.0-SNAPSHOT @
<
http://jenkins.mw.lab.eng.bos.redhat.com/hudson/job/Errai/ws/errai-tools/...
MavenProject: org.jboss.errai:errai-ioc:3.0-SNAPSHOT @
<
http://jenkins.mw.lab.eng.bos.redhat.com/hudson/job/Errai/ws/errai-ioc/po...
MavenProject: org.jboss.errai:errai-js:3.0-SNAPSHOT @
<
http://jenkins.mw.lab.eng.bos.redhat.com/hudson/job/Errai/ws/errai-js/pom...
MavenProject: org.jboss.errai:cdi-integration-parent:3.0-SNAPSHOT @
<
http://jenkins.mw.lab.eng.bos.redhat.com/hudson/job/Errai/ws/errai-cdi/po...
MavenProject: org.jboss.errai:errai-cdi-jetty:3.0-SNAPSHOT @
<
http://jenkins.mw.lab.eng.bos.redhat.com/hudson/job/Errai/ws/errai-cdi/je...
MavenProject: org.jboss.errai:errai-ioc-bus-support:3.0-SNAPSHOT @
<
http://jenkins.mw.lab.eng.bos.redhat.com/hudson/job/Errai/ws/errai-ioc-bu...
MavenProject: org.jboss.errai:errai-cdi-client:3.0-SNAPSHOT @
<
http://jenkins.mw.lab.eng.bos.redhat.com/hudson/job/Errai/ws/errai-cdi/er...
MavenProject: org.jboss.errai:errai-data-binding:3.0-SNAPSHOT @
<
http://jenkins.mw.lab.eng.bos.redhat.com/hudson/job/Errai/ws/errai-data-b...
MavenProject: org.jboss.errai:errai-weld-integration:3.0-SNAPSHOT @
<
http://jenkins.mw.lab.eng.bos.redhat.com/hudson/job/Errai/ws/errai-cdi/we...
MavenProject: org.jboss.errai:jaxrs-integration-parent:3.0-SNAPSHOT @
<
http://jenkins.mw.lab.eng.bos.redhat.com/hudson/job/Errai/ws/errai-jaxrs/...
MavenProject: org.jboss.errai:errai-jaxrs-provider:3.0-SNAPSHOT @
<
http://jenkins.mw.lab.eng.bos.redhat.com/hudson/job/Errai/ws/errai-jaxrs/...
MavenProject: org.jboss.errai:errai-jaxrs-client:3.0-SNAPSHOT @
<
http://jenkins.mw.lab.eng.bos.redhat.com/hudson/job/Errai/ws/errai-jaxrs/...
MavenProject: org.jboss.errai:errai-ui:3.0-SNAPSHOT @
<
http://jenkins.mw.lab.eng.bos.redhat.com/hudson/job/Errai/ws/errai-ui/pom...
MavenProject: org.jboss.errai:errai-navigation:3.0-SNAPSHOT @
<
http://jenkins.mw.lab.eng.bos.redhat.com/hudson/job/Errai/ws/errai-naviga...
MavenProject: org.jboss.errai:errai-uibinder:3.0-SNAPSHOT @
<
http://jenkins.mw.lab.eng.bos.redhat.com/hudson/job/Errai/ws/errai-uibind...
MavenProject: org.jboss.errai:errai-validation:3.0-SNAPSHOT @
<
http://jenkins.mw.lab.eng.bos.redhat.com/hudson/job/Errai/ws/errai-valida...
MavenProject: org.jboss.errai:errai-jpa-parent:3.0-SNAPSHOT @
<
http://jenkins.mw.lab.eng.bos.redhat.com/hudson/job/Errai/ws/errai-jpa/po...
MavenProject: org.jboss.errai:errai-jpa-client:3.0-SNAPSHOT @
<
http://jenkins.mw.lab.eng.bos.redhat.com/hudson/job/Errai/ws/errai-jpa/er...
MavenProject: org.jboss.errai:errai-jpa-datasync:3.0-SNAPSHOT @
<
http://jenkins.mw.lab.eng.bos.redhat.com/hudson/job/Errai/ws/errai-jpa/er...
MavenProject: org.jboss.errai:errai-html5:3.0-SNAPSHOT @
<
http://jenkins.mw.lab.eng.bos.redhat.com/hudson/job/Errai/ws/errai-html5/...
MavenProject: org.jboss.errai:errai-javaee-all:3.0-SNAPSHOT @
<
http://jenkins.mw.lab.eng.bos.redhat.com/hudson/job/Errai/ws/errai-javaee...
MavenProject: org.jboss.errai:errai-ioc-async-tests:3.0-SNAPSHOT @
<
http://jenkins.mw.lab.eng.bos.redhat.com/hudson/job/Errai/ws/errai-ioc-as...
MavenProject: org.jboss.errai:errai-cdi-async-tests:3.0-SNAPSHOT @
<
http://jenkins.mw.lab.eng.bos.redhat.com/hudson/job/Errai/ws/errai-cdi-as...
MavenProject: org.jboss.errai:errai-cordova:3.0-SNAPSHOT @
<
http://jenkins.mw.lab.eng.bos.redhat.com/hudson/job/Errai/ws/errai-cordov...
MavenProject: org.jboss.errai:cordova-maven-plugin:3.0-SNAPSHOT @
<
http://jenkins.mw.lab.eng.bos.redhat.com/hudson/job/Errai/ws/errai-cordov...
MavenProject: org.jboss.errai:errai-bus-jboss7-websocket:3.0-SNAPSHOT @
<
http://jenkins.mw.lab.eng.bos.redhat.com/hudson/job/Errai/ws/errai-bus-jb...
MavenProject: org.jboss.errai:errai-jboss-as-support:3.0-SNAPSHOT @
<
http://jenkins.mw.lab.eng.bos.redhat.com/hudson/job/Errai/ws/errai-jboss-...
MavenProject: org.jboss.errai:errai-otec:3.0-SNAPSHOT @
<
http://jenkins.mw.lab.eng.bos.redhat.com/hudson/job/Errai/ws/errai-otec/p...
MavenProject: org.jboss.errai:errai-security:3.0-SNAPSHOT @
<
http://jenkins.mw.lab.eng.bos.redhat.com/hudson/job/Errai/ws/errai-securi...
MavenProject: org.jboss.errai:errai-cdi-async-databinding-tests:3.0-SNAPSHOT @
<
http://jenkins.mw.lab.eng.bos.redhat.com/hudson/job/Errai/ws/errai-cdi-as...
MavenProject: org.jboss.errai.bom:errai-bom:3.0-SNAPSHOT @
<
http://jenkins.mw.lab.eng.bos.redhat.com/hudson/job/Errai/ws/errai-bom/po...
MavenProject: org.jboss.errai.demos:errai-bus-demo-stress-test:3.0-SNAPSHOT @
<
http://jenkins.mw.lab.eng.bos.redhat.com/hudson/job/Errai/ws/errai-demos/...
MavenProject: org.jboss.errai.demos:errai-bus-demo-stock:3.0-SNAPSHOT @
<
http://jenkins.mw.lab.eng.bos.redhat.com/hudson/job/Errai/ws/errai-demos/...
MavenProject: org.jboss.errai.demos:errai-cdi-demo-mobile:3.0-SNAPSHOT @
<
http://jenkins.mw.lab.eng.bos.redhat.com/hudson/job/Errai/ws/errai-demos/...
MavenProject: org.jboss.errai.demos:errai-cdi-demo-mvp:3.0-SNAPSHOT @
<
http://jenkins.mw.lab.eng.bos.redhat.com/hudson/job/Errai/ws/errai-demos/...
MavenProject: org.jboss.errai.demos:errai-cdi-demo-tagcloud:3.0-SNAPSHOT @
<
http://jenkins.mw.lab.eng.bos.redhat.com/hudson/job/Errai/ws/errai-demos/...
MavenProject: org.jboss.errai.demos:errai-jpa-demo-basic:3.0-SNAPSHOT @
<
http://jenkins.mw.lab.eng.bos.redhat.com/hudson/job/Errai/ws/errai-demos/...
MavenProject: org.jboss.errai.demos:errai-jpa-demo-grocery-list:3.0-SNAPSHOT @
<
http://jenkins.mw.lab.eng.bos.redhat.com/hudson/job/Errai/ws/errai-demos/...
MavenProject: org.jboss.errai.demos:errai-jpa-demo-todo-list:3.0-SNAPSHOT @
<
http://jenkins.mw.lab.eng.bos.redhat.com/hudson/job/Errai/ws/errai-demos/...
MavenProject: org.jboss.errai.demos:errai-jaxrs-demo-crud:3.0-SNAPSHOT @
<
http://jenkins.mw.lab.eng.bos.redhat.com/hudson/job/Errai/ws/errai-demos/...
MavenProject: org.jboss.errai.demos:errai-ui-demos-i18ndemo:3.0-SNAPSHOT @
<
http://jenkins.mw.lab.eng.bos.redhat.com/hudson/job/Errai/ws/errai-demos/...
MavenProject: org.jboss.errai.example:errai-aerogear-demo:3.0-SNAPSHOT @
<
http://jenkins.mw.lab.eng.bos.redhat.com/hudson/job/Errai/ws/errai-demos/...
MavenProject: org.jboss.errai:errai-demos:3.0-SNAPSHOT @
<
http://jenkins.mw.lab.eng.bos.redhat.com/hudson/job/Errai/ws/errai-demos/...
MavenProject: org.jboss.errai:errai-reference-guide:3.0-SNAPSHOT @
<
http://jenkins.mw.lab.eng.bos.redhat.com/hudson/job/Errai/ws/reference/po...
MavenProject: org.jboss.errai:errai-quickstart-guide:3.0-SNAPSHOT @
<
http://jenkins.mw.lab.eng.bos.redhat.com/hudson/job/Errai/ws/quickstart/p...
MavenProject: org.jboss.errai:errai-distribution:3.0-SNAPSHOT @
<
http://jenkins.mw.lab.eng.bos.redhat.com/hudson/job/Errai/ws/dist/pom.xml...
[JENKINS] Archiving
<
http://jenkins.mw.lab.eng.bos.redhat.com/hudson/job/Errai/ws/errai-cdi/po... to
/qa/hudson_master/hudson_home/hudson_workspace/jobs/Errai/modules/org.jboss.errai$cdi-integration-parent/builds/2013-10-02_17-02-13/archive/org.jboss.errai/cdi-integration-parent/3.0-SNAPSHOT/cdi-integration-parent-3.0-SNAPSHOT.pom
[JENKINS] Archiving
<
http://jenkins.mw.lab.eng.bos.redhat.com/hudson/job/Errai/ws/errai-naviga...
to
/qa/hudson_master/hudson_home/hudson_workspace/jobs/Errai/modules/org.jboss.errai$errai-navigation/builds/2013-10-02_17-02-13/archive/org.jboss.errai/errai-navigation/3.0-SNAPSHOT/errai-navigation-3.0-SNAPSHOT.pom
[JENKINS] Archiving
<
http://jenkins.mw.lab.eng.bos.redhat.com/hudson/job/Errai/ws/errai-bus-jb...
to
/qa/hudson_master/hudson_home/hudson_workspace/jobs/Errai/modules/org.jboss.errai$errai-bus-jboss7-websocket/builds/2013-10-02_17-02-13/archive/org.jboss.errai/errai-bus-jboss7-websocket/3.0-SNAPSHOT/errai-bus-jboss7-websocket-3.0-SNAPSHOT.pom
[JENKINS] Archiving
<
http://jenkins.mw.lab.eng.bos.redhat.com/hudson/job/Errai/ws/errai-demos/...
to
/qa/hudson_master/hudson_home/hudson_workspace/jobs/Errai/modules/org.jboss.errai.demos$errai-ui-demos-i18ndemo/builds/2013-10-02_17-02-14/archive/org.jboss.errai.demos/errai-ui-demos-i18ndemo/3.0-SNAPSHOT/errai-ui-demos-i18ndemo-3.0-SNAPSHOT.pom
[JENKINS] Archiving
<
http://jenkins.mw.lab.eng.bos.redhat.com/hudson/job/Errai/ws/errai-bom/po... to
/qa/hudson_master/hudson_home/hudson_workspace/jobs/Errai/modules/org.jboss.errai.bom$errai-bom/builds/2013-10-02_17-02-14/archive/org.jboss.errai.bom/errai-bom/3.0-SNAPSHOT/errai-bom-3.0-SNAPSHOT.pom
[JENKINS] Archiving
<
http://jenkins.mw.lab.eng.bos.redhat.com/hudson/job/Errai/ws/errai-jaxrs/...
to
/qa/hudson_master/hudson_home/hudson_workspace/jobs/Errai/modules/org.jboss.errai$jaxrs-integration-parent/builds/2013-10-02_17-02-13/archive/org.jboss.errai/jaxrs-integration-parent/3.0-SNAPSHOT/jaxrs-integration-parent-3.0-SNAPSHOT.pom
[JENKINS] Archiving
<
http://jenkins.mw.lab.eng.bos.redhat.com/hudson/job/Errai/ws/errai-reflec...
to
/qa/hudson_master/hudson_home/hudson_workspace/jobs/Errai/modules/org.jboss.errai.reflections$reflections-parent/builds/2013-10-02_17-02-13/archive/org.jboss.errai.reflections/reflections-parent/3.0-SNAPSHOT/reflections-parent-3.0-SNAPSHOT.pom
[JENKINS] Archiving
<
http://jenkins.mw.lab.eng.bos.redhat.com/hudson/job/Errai/ws/errai-demos/...
to
/qa/hudson_master/hudson_home/hudson_workspace/jobs/Errai/modules/org.jboss.errai.demos$errai-cdi-demo-mobile/builds/2013-10-02_17-02-14/archive/org.jboss.errai.demos/errai-cdi-demo-mobile/3.0-SNAPSHOT/errai-cdi-demo-mobile-3.0-SNAPSHOT.pom
[JENKINS] Archiving
<
http://jenkins.mw.lab.eng.bos.redhat.com/hudson/job/Errai/ws/errai-ioc/po... to
/qa/hudson_master/hudson_home/hudson_workspace/jobs/Errai/modules/org.jboss.errai$errai-ioc/builds/2013-10-02_17-02-12/archive/org.jboss.errai/errai-ioc/3.0-SNAPSHOT/errai-ioc-3.0-SNAPSHOT.pom
[JENKINS] Archiving
<
http://jenkins.mw.lab.eng.bos.redhat.com/hudson/job/Errai/ws/errai-common...
to
/qa/hudson_master/hudson_home/hudson_workspace/jobs/Errai/modules/org.jboss.errai$errai-common/builds/2013-10-02_17-02-12/archive/org.jboss.errai/errai-common/3.0-SNAPSHOT/errai-common-3.0-SNAPSHOT.pom
[JENKINS] Archiving
<
http://jenkins.mw.lab.eng.bos.redhat.com/hudson/job/Errai/ws/errai-common...
to
/qa/hudson_master/hudson_home/hudson_workspace/jobs/Errai/modules/org.jboss.errai$errai-common/builds/2013-10-02_17-02-12/archive/org.jboss.errai/errai-common/3.0-20131002.210422-268/errai-common-3.0-20131002.210422-268.jar
[JENKINS] Archiving
<
http://jenkins.mw.lab.eng.bos.redhat.com/hudson/job/Errai/ws/errai-common...
to
/qa/hudson_master/hudson_home/hudson_workspace/jobs/Errai/modules/org.jboss.errai$errai-common/builds/2013-10-02_17-02-12/archive/org.jboss.errai/errai-common/3.0-20131002.210422-268/errai-common-3.0-20131002.210422-268-sources.jar
[JENKINS] Archiving
<
http://jenkins.mw.lab.eng.bos.redhat.com/hudson/job/Errai/ws/errai-versio...
to
/qa/hudson_master/hudson_home/hudson_workspace/jobs/Errai/modules/org.jboss.errai.bom$errai-version-master/builds/2013-10-02_17-02-12/archive/org.jboss.errai.bom/errai-version-master/3.0-SNAPSHOT/errai-version-master-3.0-SNAPSHOT.pom
[JENKINS] Archiving
<
http://jenkins.mw.lab.eng.bos.redhat.com/hudson/job/Errai/ws/errai-jaxrs/...
to
/qa/hudson_master/hudson_home/hudson_workspace/jobs/Errai/modules/org.jboss.errai$errai-jaxrs-provider/builds/2013-10-02_17-02-13/archive/org.jboss.errai/errai-jaxrs-provider/3.0-SNAPSHOT/errai-jaxrs-provider-3.0-SNAPSHOT.pom
[JENKINS] Archiving
<
http://jenkins.mw.lab.eng.bos.redhat.com/hudson/job/Errai/ws/errai-data-b...
to
/qa/hudson_master/hudson_home/hudson_workspace/jobs/Errai/modules/org.jboss.errai$errai-data-binding/builds/2013-10-02_17-02-13/archive/org.jboss.errai/errai-data-binding/3.0-SNAPSHOT/errai-data-binding-3.0-SNAPSHOT.pom
[JENKINS] Archiving
<
http://jenkins.mw.lab.eng.bos.redhat.com/hudson/job/Errai/ws/errai-cordov...
to
/qa/hudson_master/hudson_home/hudson_workspace/jobs/Errai/modules/org.jboss.errai$cordova-maven-plugin/builds/2013-10-02_17-02-13/archive/org.jboss.errai/cordova-maven-plugin/3.0-SNAPSHOT/cordova-maven-plugin-3.0-SNAPSHOT.pom
[JENKINS] Archiving
<
http://jenkins.mw.lab.eng.bos.redhat.com/hudson/job/Errai/ws/errai-cdi/we...
to
/qa/hudson_master/hudson_home/hudson_workspace/jobs/Errai/modules/org.jboss.errai$errai-weld-integration/builds/2013-10-02_17-02-13/archive/org.jboss.errai/errai-weld-integration/3.0-SNAPSHOT/errai-weld-integration-3.0-SNAPSHOT.pom
[JENKINS] Archiving
<
http://jenkins.mw.lab.eng.bos.redhat.com/hudson/job/Errai/ws/errai-otec/p... to
/qa/hudson_master/hudson_home/hudson_workspace/jobs/Errai/modules/org.jboss.errai$errai-otec/builds/2013-10-02_17-02-13/archive/org.jboss.errai/errai-otec/3.0-SNAPSHOT/errai-otec-3.0-SNAPSHOT.pom
[JENKINS] Archiving
<
http://jenkins.mw.lab.eng.bos.redhat.com/hudson/job/Errai/ws/errai-uibind...
to
/qa/hudson_master/hudson_home/hudson_workspace/jobs/Errai/modules/org.jboss.errai$errai-uibinder/builds/2013-10-02_17-02-13/archive/org.jboss.errai/errai-uibinder/3.0-SNAPSHOT/errai-uibinder-3.0-SNAPSHOT.pom
[JENKINS] Archiving
<
http://jenkins.mw.lab.eng.bos.redhat.com/hudson/job/Errai/ws/errai-demos/...
to
/qa/hudson_master/hudson_home/hudson_workspace/jobs/Errai/modules/org.jboss.errai.demos$errai-cdi-demo-tagcloud/builds/2013-10-02_17-02-14/archive/org.jboss.errai.demos/errai-cdi-demo-tagcloud/3.0-SNAPSHOT/errai-cdi-demo-tagcloud-3.0-SNAPSHOT.pom
[JENKINS] Archiving
<
http://jenkins.mw.lab.eng.bos.redhat.com/hudson/job/Errai/ws/quickstart/p... to
/qa/hudson_master/hudson_home/hudson_workspace/jobs/Errai/modules/org.jboss.errai$errai-quickstart-guide/builds/2013-10-02_17-02-14/archive/org.jboss.errai/errai-quickstart-guide/3.0-SNAPSHOT/errai-quickstart-guide-3.0-SNAPSHOT.pom
[JENKINS] Archiving
<
http://jenkins.mw.lab.eng.bos.redhat.com/hudson/job/Errai/ws/pom.xml> to
/qa/hudson_master/hudson_home/hudson_workspace/jobs/Errai/modules/org.jboss.errai$errai-parent/builds/2013-10-02_17-02-12/archive/org.jboss.errai/errai-parent/3.0-SNAPSHOT/errai-parent-3.0-SNAPSHOT.pom
[JENKINS] Archiving
<
http://jenkins.mw.lab.eng.bos.redhat.com/hudson/job/Errai/ws/errai-cordov...
to
/qa/hudson_master/hudson_home/hudson_workspace/jobs/Errai/modules/org.jboss.errai$errai-cordova/builds/2013-10-02_17-02-13/archive/org.jboss.errai/errai-cordova/3.0-SNAPSHOT/errai-cordova-3.0-SNAPSHOT.pom
[JENKINS] Archiving
<
http://jenkins.mw.lab.eng.bos.redhat.com/hudson/job/Errai/ws/errai-reflec...
to
/qa/hudson_master/hudson_home/hudson_workspace/jobs/Errai/modules/org.jboss.errai.reflections$reflections/builds/2013-10-02_17-02-13/archive/org.jboss.errai.reflections/reflections/3.0-SNAPSHOT/reflections-3.0-SNAPSHOT.pom
[JENKINS] Archiving
<
http://jenkins.mw.lab.eng.bos.redhat.com/hudson/job/Errai/ws/errai-reflec...
to
/qa/hudson_master/hudson_home/hudson_workspace/jobs/Errai/modules/org.jboss.errai.reflections$reflections/builds/2013-10-02_17-02-13/archive/org.jboss.errai.reflections/reflections/3.0-20131002.210352-266/reflections-3.0-20131002.210352-266.jar
[JENKINS] Archiving
<
http://jenkins.mw.lab.eng.bos.redhat.com/hudson/job/Errai/ws/errai-reflec...
to
/qa/hudson_master/hudson_home/hudson_workspace/jobs/Errai/modules/org.jboss.errai.reflections$reflections/builds/2013-10-02_17-02-13/archive/org.jboss.errai.reflections/reflections/3.0-20131002.210352-266/reflections-3.0-20131002.210352-266-javadoc.jar
[JENKINS] Archiving
<
http://jenkins.mw.lab.eng.bos.redhat.com/hudson/job/Errai/ws/errai-reflec...
to
/qa/hudson_master/hudson_home/hudson_workspace/jobs/Errai/modules/org.jboss.errai.reflections$reflections/builds/2013-10-02_17-02-13/archive/org.jboss.errai.reflections/reflections/3.0-20131002.210352-266/reflections-3.0-20131002.210352-266-sources.jar
[JENKINS] Archiving
<
http://jenkins.mw.lab.eng.bos.redhat.com/hudson/job/Errai/ws/errai-cdi-as...
to
/qa/hudson_master/hudson_home/hudson_workspace/jobs/Errai/modules/org.jboss.errai$errai-cdi-async-tests/builds/2013-10-02_17-02-13/archive/org.jboss.errai/errai-cdi-async-tests/3.0-SNAPSHOT/errai-cdi-async-tests-3.0-SNAPSHOT.pom
[JENKINS] Archiving
<
http://jenkins.mw.lab.eng.bos.redhat.com/hudson/job/Errai/ws/errai-ioc-as...
to
/qa/hudson_master/hudson_home/hudson_workspace/jobs/Errai/modules/org.jboss.errai$errai-ioc-async-tests/builds/2013-10-02_17-02-13/archive/org.jboss.errai/errai-ioc-async-tests/3.0-SNAPSHOT/errai-ioc-async-tests-3.0-SNAPSHOT.pom
[JENKINS] Archiving
<
http://jenkins.mw.lab.eng.bos.redhat.com/hudson/job/Errai/ws/errai-jpa/po... to
/qa/hudson_master/hudson_home/hudson_workspace/jobs/Errai/modules/org.jboss.errai$errai-jpa-parent/builds/2013-10-02_17-02-13/archive/org.jboss.errai/errai-jpa-parent/3.0-SNAPSHOT/errai-jpa-parent-3.0-SNAPSHOT.pom
[JENKINS] Archiving
<
http://jenkins.mw.lab.eng.bos.redhat.com/hudson/job/Errai/ws/errai-securi...
to
/qa/hudson_master/hudson_home/hudson_workspace/jobs/Errai/modules/org.jboss.errai$errai-security/builds/2013-10-02_17-02-13/archive/org.jboss.errai/errai-security/3.0-SNAPSHOT/errai-security-3.0-SNAPSHOT.pom
[JENKINS] Archiving
<
http://jenkins.mw.lab.eng.bos.redhat.com/hudson/job/Errai/ws/errai-cdi-as...
to
/qa/hudson_master/hudson_home/hudson_workspace/jobs/Errai/modules/org.jboss.errai$errai-cdi-async-databinding-tests/builds/2013-10-02_17-02-14/archive/org.jboss.errai/errai-cdi-async-databinding-tests/3.0-SNAPSHOT/errai-cdi-async-databinding-tests-3.0-SNAPSHOT.pom
[JENKINS] Archiving
<
http://jenkins.mw.lab.eng.bos.redhat.com/hudson/job/Errai/ws/errai-ui/pom... to
/qa/hudson_master/hudson_home/hudson_workspace/jobs/Errai/modules/org.jboss.errai$errai-ui/builds/2013-10-02_17-02-13/archive/org.jboss.errai/errai-ui/3.0-SNAPSHOT/errai-ui-3.0-SNAPSHOT.pom
[JENKINS] Archiving
<
http://jenkins.mw.lab.eng.bos.redhat.com/hudson/job/Errai/ws/errai-demos/...
to
/qa/hudson_master/hudson_home/hudson_workspace/jobs/Errai/modules/org.jboss.errai.demos$errai-jaxrs-demo-crud/builds/2013-10-02_17-02-14/archive/org.jboss.errai.demos/errai-jaxrs-demo-crud/3.0-SNAPSHOT/errai-jaxrs-demo-crud-3.0-SNAPSHOT.pom
[JENKINS] Archiving
<
http://jenkins.mw.lab.eng.bos.redhat.com/hudson/job/Errai/ws/errai-demos/...
to
/qa/hudson_master/hudson_home/hudson_workspace/jobs/Errai/modules/org.jboss.errai.demos$errai-cdi-demo-mvp/builds/2013-10-02_17-02-14/archive/org.jboss.errai.demos/errai-cdi-demo-mvp/3.0-SNAPSHOT/errai-cdi-demo-mvp-3.0-SNAPSHOT.pom
[JENKINS] Archiving
<
http://jenkins.mw.lab.eng.bos.redhat.com/hudson/job/Errai/ws/errai-valida...
to
/qa/hudson_master/hudson_home/hudson_workspace/jobs/Errai/modules/org.jboss.errai$errai-validation/builds/2013-10-02_17-02-13/archive/org.jboss.errai/errai-validation/3.0-SNAPSHOT/errai-validation-3.0-SNAPSHOT.pom
[JENKINS] Archiving
<
http://jenkins.mw.lab.eng.bos.redhat.com/hudson/job/Errai/ws/errai-config...
to
/qa/hudson_master/hudson_home/hudson_workspace/jobs/Errai/modules/org.jboss.errai$errai-config/builds/2013-10-02_17-02-13/archive/org.jboss.errai/errai-config/3.0-SNAPSHOT/errai-config-3.0-SNAPSHOT.pom
[JENKINS] Archiving
<
http://jenkins.mw.lab.eng.bos.redhat.com/hudson/job/Errai/ws/errai-config...
to
/qa/hudson_master/hudson_home/hudson_workspace/jobs/Errai/modules/org.jboss.errai$errai-config/builds/2013-10-02_17-02-13/archive/org.jboss.errai/errai-config/3.0-20131002.210604-268/errai-config-3.0-20131002.210604-268.jar
[JENKINS] Archiving
<
http://jenkins.mw.lab.eng.bos.redhat.com/hudson/job/Errai/ws/errai-config...
to
/qa/hudson_master/hudson_home/hudson_workspace/jobs/Errai/modules/org.jboss.errai$errai-config/builds/2013-10-02_17-02-13/archive/org.jboss.errai/errai-config/3.0-20131002.210604-268/errai-config-3.0-20131002.210604-268-sources.jar
[JENKINS] Archiving
<
http://jenkins.mw.lab.eng.bos.redhat.com/hudson/job/Errai/ws/errai-marsha...
to
/qa/hudson_master/hudson_home/hudson_workspace/jobs/Errai/modules/org.jboss.errai$errai-marshalling/builds/2013-10-02_17-02-12/archive/org.jboss.errai/errai-marshalling/3.0-SNAPSHOT/errai-marshalling-3.0-SNAPSHOT.pom
[JENKINS] Archiving
<
http://jenkins.mw.lab.eng.bos.redhat.com/hudson/job/Errai/ws/errai-marsha...
to
/qa/hudson_master/hudson_home/hudson_workspace/jobs/Errai/modules/org.jboss.errai$errai-marshalling/builds/2013-10-02_17-02-12/archive/org.jboss.errai/errai-marshalling/3.0-20131002.210639-266/errai-marshalling-3.0-20131002.210639-266.jar
[JENKINS] Archiving
<
http://jenkins.mw.lab.eng.bos.redhat.com/hudson/job/Errai/ws/errai-marsha...
to
/qa/hudson_master/hudson_home/hudson_workspace/jobs/Errai/modules/org.jboss.errai$errai-marshalling/builds/2013-10-02_17-02-12/archive/org.jboss.errai/errai-marshalling/3.0-20131002.210639-266/errai-marshalling-3.0-20131002.210639-266-sources.jar
[JENKINS] Archiving
<
http://jenkins.mw.lab.eng.bos.redhat.com/hudson/job/Errai/ws/errai-ioc-bu...
to
/qa/hudson_master/hudson_home/hudson_workspace/jobs/Errai/modules/org.jboss.errai$errai-ioc-bus-support/builds/2013-10-02_17-02-13/archive/org.jboss.errai/errai-ioc-bus-support/3.0-SNAPSHOT/errai-ioc-bus-support-3.0-SNAPSHOT.pom
[JENKINS] Archiving
<
http://jenkins.mw.lab.eng.bos.redhat.com/hudson/job/Errai/ws/errai-jpa/er...
to
/qa/hudson_master/hudson_home/hudson_workspace/jobs/Errai/modules/org.jboss.errai$errai-jpa-client/builds/2013-10-02_17-02-13/archive/org.jboss.errai/errai-jpa-client/3.0-SNAPSHOT/errai-jpa-client-3.0-SNAPSHOT.pom
[JENKINS] Archiving
<
http://jenkins.mw.lab.eng.bos.redhat.com/hudson/job/Errai/ws/errai-codege...
to
/qa/hudson_master/hudson_home/hudson_workspace/jobs/Errai/modules/org.jboss.errai$errai-codegen/builds/2013-10-02_17-02-12/archive/org.jboss.errai/errai-codegen/3.0-SNAPSHOT/errai-codegen-3.0-SNAPSHOT.pom
[JENKINS] Archiving
<
http://jenkins.mw.lab.eng.bos.redhat.com/hudson/job/Errai/ws/errai-codege...
to
/qa/hudson_master/hudson_home/hudson_workspace/jobs/Errai/modules/org.jboss.errai$errai-codegen/builds/2013-10-02_17-02-12/archive/org.jboss.errai/errai-codegen/3.0-20131002.210519-264/errai-codegen-3.0-20131002.210519-264.jar
[JENKINS] Archiving
<
http://jenkins.mw.lab.eng.bos.redhat.com/hudson/job/Errai/ws/errai-codege...
to
/qa/hudson_master/hudson_home/hudson_workspace/jobs/Errai/modules/org.jboss.errai$errai-codegen/builds/2013-10-02_17-02-12/archive/org.jboss.errai/errai-codegen/3.0-20131002.210519-264/errai-codegen-3.0-20131002.210519-264-tests.jar
[JENKINS] Archiving
<
http://jenkins.mw.lab.eng.bos.redhat.com/hudson/job/Errai/ws/errai-codege...
to
/qa/hudson_master/hudson_home/hudson_workspace/jobs/Errai/modules/org.jboss.errai$errai-codegen/builds/2013-10-02_17-02-12/archive/org.jboss.errai/errai-codegen/3.0-20131002.210519-264/errai-codegen-3.0-20131002.210519-264-sources.jar
[JENKINS] Archiving
<
http://jenkins.mw.lab.eng.bos.redhat.com/hudson/job/Errai/ws/errai-jboss-...
to
/qa/hudson_master/hudson_home/hudson_workspace/jobs/Errai/modules/org.jboss.errai$errai-jboss-as-support/builds/2013-10-02_17-02-13/archive/org.jboss.errai/errai-jboss-as-support/3.0-SNAPSHOT/errai-jboss-as-support-3.0-SNAPSHOT.pom
[JENKINS] Archiving
<
http://jenkins.mw.lab.eng.bos.redhat.com/hudson/job/Errai/ws/reference/po... to
/qa/hudson_master/hudson_home/hudson_workspace/jobs/Errai/modules/org.jboss.errai$errai-reference-guide/builds/2013-10-02_17-02-14/archive/org.jboss.errai/errai-reference-guide/3.0-SNAPSHOT/errai-reference-guide-3.0-SNAPSHOT.pom
[JENKINS] Archiving
<
http://jenkins.mw.lab.eng.bos.redhat.com/hudson/job/Errai/ws/errai-js/pom... to
/qa/hudson_master/hudson_home/hudson_workspace/jobs/Errai/modules/org.jboss.errai$errai-js/builds/2013-10-02_17-02-12/archive/org.jboss.errai/errai-js/3.0-SNAPSHOT/errai-js-3.0-SNAPSHOT.pom
[JENKINS] Archiving
<
http://jenkins.mw.lab.eng.bos.redhat.com/hudson/job/Errai/ws/errai-demos/...
to
/qa/hudson_master/hudson_home/hudson_workspace/jobs/Errai/modules/org.jboss.errai$errai-demos/builds/2013-10-02_17-02-14/archive/org.jboss.errai/errai-demos/3.0-SNAPSHOT/errai-demos-3.0-SNAPSHOT.pom
[JENKINS] Archiving
<
http://jenkins.mw.lab.eng.bos.redhat.com/hudson/job/Errai/ws/errai-codege...
to
/qa/hudson_master/hudson_home/hudson_workspace/jobs/Errai/modules/org.jboss.errai$errai-codegen-gwt/builds/2013-10-02_17-02-13/archive/org.jboss.errai/errai-codegen-gwt/3.0-SNAPSHOT/errai-codegen-gwt-3.0-SNAPSHOT.pom
[JENKINS] Archiving
<
http://jenkins.mw.lab.eng.bos.redhat.com/hudson/job/Errai/ws/errai-codege...
to
/qa/hudson_master/hudson_home/hudson_workspace/jobs/Errai/modules/org.jboss.errai$errai-codegen-gwt/builds/2013-10-02_17-02-13/archive/org.jboss.errai/errai-codegen-gwt/3.0-20131002.210547-264/errai-codegen-gwt-3.0-20131002.210547-264.jar
[JENKINS] Archiving
<
http://jenkins.mw.lab.eng.bos.redhat.com/hudson/job/Errai/ws/errai-codege...
to
/qa/hudson_master/hudson_home/hudson_workspace/jobs/Errai/modules/org.jboss.errai$errai-codegen-gwt/builds/2013-10-02_17-02-13/archive/org.jboss.errai/errai-codegen-gwt/3.0-20131002.210547-264/errai-codegen-gwt-3.0-20131002.210547-264-sources.jar
[JENKINS] Archiving
<
http://jenkins.mw.lab.eng.bos.redhat.com/hudson/job/Errai/ws/errai-demos/...
to
/qa/hudson_master/hudson_home/hudson_workspace/jobs/Errai/modules/org.jboss.errai.demos$errai-jpa-demo-todo-list/builds/2013-10-02_17-02-14/archive/org.jboss.errai.demos/errai-jpa-demo-todo-list/3.0-SNAPSHOT/errai-jpa-demo-todo-list-3.0-SNAPSHOT.pom
[JENKINS] Archiving
<
http://jenkins.mw.lab.eng.bos.redhat.com/hudson/job/Errai/ws/errai-demos/...
to
/qa/hudson_master/hudson_home/hudson_workspace/jobs/Errai/modules/org.jboss.errai.demos$errai-jpa-demo-grocery-list/builds/2013-10-02_17-02-14/archive/org.jboss.errai.demos/errai-jpa-demo-grocery-list/3.0-SNAPSHOT/errai-jpa-demo-grocery-list-3.0-SNAPSHOT.pom
[JENKINS] Archiving
<
http://jenkins.mw.lab.eng.bos.redhat.com/hudson/job/Errai/ws/errai-demos/...
to
/qa/hudson_master/hudson_home/hudson_workspace/jobs/Errai/modules/org.jboss.errai.example$errai-aerogear-demo/builds/2013-10-02_17-02-14/archive/org.jboss.errai.example/errai-aerogear-demo/3.0-SNAPSHOT/errai-aerogear-demo-3.0-SNAPSHOT.pom
[JENKINS] Archiving
<
http://jenkins.mw.lab.eng.bos.redhat.com/hudson/job/Errai/ws/errai-cdi/je...
to
/qa/hudson_master/hudson_home/hudson_workspace/jobs/Errai/modules/org.jboss.errai$errai-cdi-jetty/builds/2013-10-02_17-02-13/archive/org.jboss.errai/errai-cdi-jetty/3.0-SNAPSHOT/errai-cdi-jetty-3.0-SNAPSHOT.pom
[JENKINS] Archiving
<
http://jenkins.mw.lab.eng.bos.redhat.com/hudson/job/Errai/ws/errai-javaee...
to
/qa/hudson_master/hudson_home/hudson_workspace/jobs/Errai/modules/org.jboss.errai$errai-javaee-all/builds/2013-10-02_17-02-13/archive/org.jboss.errai/errai-javaee-all/3.0-SNAPSHOT/errai-javaee-all-3.0-SNAPSHOT.pom
[JENKINS] Archiving
<
http://jenkins.mw.lab.eng.bos.redhat.com/hudson/job/Errai/ws/errai-html5/...
to
/qa/hudson_master/hudson_home/hudson_workspace/jobs/Errai/modules/org.jboss.errai$errai-html5/builds/2013-10-02_17-02-13/archive/org.jboss.errai/errai-html5/3.0-SNAPSHOT/errai-html5-3.0-SNAPSHOT.pom
[JENKINS] Archiving
<
http://jenkins.mw.lab.eng.bos.redhat.com/hudson/job/Errai/ws/errai-demos/...
to
/qa/hudson_master/hudson_home/hudson_workspace/jobs/Errai/modules/org.jboss.errai.demos$errai-jpa-demo-basic/builds/2013-10-02_17-02-14/archive/org.jboss.errai.demos/errai-jpa-demo-basic/3.0-SNAPSHOT/errai-jpa-demo-basic-3.0-SNAPSHOT.pom
[JENKINS] Archiving
<
http://jenkins.mw.lab.eng.bos.redhat.com/hudson/job/Errai/ws/errai-bus/po... to
/qa/hudson_master/hudson_home/hudson_workspace/jobs/Errai/modules/org.jboss.errai$errai-bus/builds/2013-10-02_17-02-12/archive/org.jboss.errai/errai-bus/3.0-SNAPSHOT/errai-bus-3.0-SNAPSHOT.pom
[JENKINS] Archiving
<
http://jenkins.mw.lab.eng.bos.redhat.com/hudson/job/Errai/ws/errai-tools/...
to
/qa/hudson_master/hudson_home/hudson_workspace/jobs/Errai/modules/org.jboss.errai$errai-tools/builds/2013-10-02_17-02-12/archive/org.jboss.errai/errai-tools/3.0-SNAPSHOT/errai-tools-3.0-SNAPSHOT.pom
[JENKINS] Archiving
<
http://jenkins.mw.lab.eng.bos.redhat.com/hudson/job/Errai/ws/errai-javax-...
to
/qa/hudson_master/hudson_home/hudson_workspace/jobs/Errai/modules/org.jboss.errai$errai-javax-enterprise/builds/2013-10-02_17-02-12/archive/org.jboss.errai/errai-javax-enterprise/3.0-SNAPSHOT/errai-javax-enterprise-3.0-SNAPSHOT.pom
[JENKINS] Archiving
<
http://jenkins.mw.lab.eng.bos.redhat.com/hudson/job/Errai/ws/errai-javax-...
to
/qa/hudson_master/hudson_home/hudson_workspace/jobs/Errai/modules/org.jboss.errai$errai-javax-enterprise/builds/2013-10-02_17-02-12/archive/org.jboss.errai/errai-javax-enterprise/3.0-20131002.210435-265/errai-javax-enterprise-3.0-20131002.210435-265.jar
[JENKINS] Archiving
<
http://jenkins.mw.lab.eng.bos.redhat.com/hudson/job/Errai/ws/errai-javax-...
to
/qa/hudson_master/hudson_home/hudson_workspace/jobs/Errai/modules/org.jboss.errai$errai-javax-enterprise/builds/2013-10-02_17-02-12/archive/org.jboss.errai/errai-javax-enterprise/3.0-20131002.210435-265/errai-javax-enterprise-3.0-20131002.210435-265-sources.jar
[JENKINS] Archiving
<
http://jenkins.mw.lab.eng.bos.redhat.com/hudson/job/Errai/ws/errai-cdi/er...
to
/qa/hudson_master/hudson_home/hudson_workspace/jobs/Errai/modules/org.jboss.errai$errai-cdi-client/builds/2013-10-02_17-02-13/archive/org.jboss.errai/errai-cdi-client/3.0-SNAPSHOT/errai-cdi-client-3.0-SNAPSHOT.pom
[JENKINS] Archiving
<
http://jenkins.mw.lab.eng.bos.redhat.com/hudson/job/Errai/ws/errai-jaxrs/...
to
/qa/hudson_master/hudson_home/hudson_workspace/jobs/Errai/modules/org.jboss.errai$errai-jaxrs-client/builds/2013-10-02_17-02-13/archive/org.jboss.errai/errai-jaxrs-client/3.0-SNAPSHOT/errai-jaxrs-client-3.0-SNAPSHOT.pom
[JENKINS] Archiving
<
http://jenkins.mw.lab.eng.bos.redhat.com/hudson/job/Errai/ws/dist/pom.xml... to
/qa/hudson_master/hudson_home/hudson_workspace/jobs/Errai/modules/org.jboss.errai$errai-distribution/builds/2013-10-02_17-02-14/archive/org.jboss.errai/errai-distribution/3.0-SNAPSHOT/errai-distribution-3.0-SNAPSHOT.pom
[JENKINS] Archiving
<
http://jenkins.mw.lab.eng.bos.redhat.com/hudson/job/Errai/ws/errai-demos/...
to
/qa/hudson_master/hudson_home/hudson_workspace/jobs/Errai/modules/org.jboss.errai.demos$errai-bus-demo-stock/builds/2013-10-02_17-02-14/archive/org.jboss.errai.demos/errai-bus-demo-stock/3.0-SNAPSHOT/errai-bus-demo-stock-3.0-SNAPSHOT.pom
[JENKINS] Archiving
<
http://jenkins.mw.lab.eng.bos.redhat.com/hudson/job/Errai/ws/errai-jpa/er...
to
/qa/hudson_master/hudson_home/hudson_workspace/jobs/Errai/modules/org.jboss.errai$errai-jpa-datasync/builds/2013-10-02_17-02-13/archive/org.jboss.errai/errai-jpa-datasync/3.0-SNAPSHOT/errai-jpa-datasync-3.0-SNAPSHOT.pom
[JENKINS] Archiving
<
http://jenkins.mw.lab.eng.bos.redhat.com/hudson/job/Errai/ws/errai-demos/...
to
/qa/hudson_master/hudson_home/hudson_workspace/jobs/Errai/modules/org.jboss.errai.demos$errai-bus-demo-stress-test/builds/2013-10-02_17-02-14/archive/org.jboss.errai.demos/errai-bus-demo-stress-test/3.0-SNAPSHOT/errai-bus-demo-stress-test-3.0-SNAPSHOT.pom
Waiting for Jenkins to finish collecting data
mavenExecutionResult exceptions not empty
message : Failed to execute goal
org.apache.maven.plugins:maven-compiler-plugin:2.3.2:testCompile (default-testCompile) on
project errai-bus: Compilation failure
cause : Compilation failure
Stack trace :
org.apache.maven.lifecycle.LifecycleExecutionException: Failed to execute goal
org.apache.maven.plugins:maven-compiler-plugin:2.3.2:testCompile (default-testCompile) on
project errai-bus: Compilation failure
at org.apache.maven.lifecycle.internal.MojoExecutor.execute(MojoExecutor.java:213)
at org.apache.maven.lifecycle.internal.MojoExecutor.execute(MojoExecutor.java:153)
at org.apache.maven.lifecycle.internal.MojoExecutor.execute(MojoExecutor.java:145)
at
org.apache.maven.lifecycle.internal.LifecycleModuleBuilder.buildProject(LifecycleModuleBuilder.java:84)
at
org.apache.maven.lifecycle.internal.LifecycleModuleBuilder.buildProject(LifecycleModuleBuilder.java:59)
at
org.apache.maven.lifecycle.internal.LifecycleStarter.singleThreadedBuild(LifecycleStarter.java:183)
at
org.apache.maven.lifecycle.internal.LifecycleStarter.execute(LifecycleStarter.java:161)
at org.apache.maven.DefaultMaven.doExecute(DefaultMaven.java:320)
at org.apache.maven.DefaultMaven.execute(DefaultMaven.java:156)
at org.jvnet.hudson.maven3.launcher.Maven3Launcher.main(Maven3Launcher.java:79)
at sun.reflect.NativeMethodAccessorImpl.invoke0(Native Method)
at sun.reflect.NativeMethodAccessorImpl.invoke(NativeMethodAccessorImpl.java:39)
at sun.reflect.DelegatingMethodAccessorImpl.invoke(DelegatingMethodAccessorImpl.java:25)
at java.lang.reflect.Method.invoke(Method.java:597)
at org.codehaus.plexus.classworlds.launcher.Launcher.launchStandard(Launcher.java:329)
at org.codehaus.plexus.classworlds.launcher.Launcher.launch(Launcher.java:239)
at org.jvnet.hudson.maven3.agent.Maven3Main.launch(Maven3Main.java:158)
at hudson.maven.Maven3Builder.call(Maven3Builder.java:98)
at hudson.maven.Maven3Builder.call(Maven3Builder.java:64)
at hudson.remoting.UserRequest.perform(UserRequest.java:118)
at hudson.remoting.UserRequest.perform(UserRequest.java:48)
at hudson.remoting.Request$2.run(Request.java:326)
at
hudson.remoting.InterceptingExecutorService$1.call(InterceptingExecutorService.java:72)
at java.util.concurrent.FutureTask$Sync.innerRun(FutureTask.java:303)
at java.util.concurrent.FutureTask.run(FutureTask.java:138)
at java.util.concurrent.ThreadPoolExecutor$Worker.runTask(ThreadPoolExecutor.java:895)
at java.util.concurrent.ThreadPoolExecutor$Worker.run(ThreadPoolExecutor.java:918)
at java.lang.Thread.run(Thread.java:662)
Caused by: org.apache.maven.plugin.CompilationFailureException: Compilation failure
at org.apache.maven.plugin.AbstractCompilerMojo.execute(AbstractCompilerMojo.java:656)
at org.apache.maven.plugin.TestCompilerMojo.execute(TestCompilerMojo.java:161)
at
org.apache.maven.plugin.DefaultBuildPluginManager.executeMojo(DefaultBuildPluginManager.java:101)
at org.apache.maven.lifecycle.internal.MojoExecutor.execute(MojoExecutor.java:209)
... 27 more
Sending e-mails to: errai-dev(a)lists.jboss.org
channel stopped