See <
http://hudson.qa.jboss.com/hudson/job/Errai/153/changes>
Changes:
[Mike Brock] Fix to IOC
[Mike Brock] delete weird file that patch created
[jfuerth] Removed temporary experimental code that was breaking the build
[jfuerth] Improved error logging in the case of delivery failure
[jfuerth] Simplified queueing, consolidated saturation policy handling, gained
performance
------------------------------------------
[...truncated 9764 lines...]
[INFO] };
[INFO] marshallers.put("[Ljava.lang.Object;", arrayOf_java_lang_Object_D1);
[INFO] }
[INFO]
[INFO] private native static void java_lang_Throwable_detailMessage(Throwable instance,
String value) /*-{
[INFO] instance.@java.lang.Throwable::detailMessage = value;
[INFO] }-*/;
[INFO]
[INFO] private native static String java_lang_Throwable_detailMessage(Throwable
instance) /*-{
[INFO] return instance.@java.lang.Throwable::detailMessage;
[INFO] }-*/;
[INFO]
[INFO] private native static void java_lang_Throwable_cause(Throwable instance,
Throwable value) /*-{
[INFO] instance.@java.lang.Throwable::cause = value;
[INFO] }-*/;
[INFO]
[INFO] private native static Throwable java_lang_Throwable_cause(Throwable instance)
/*-{
[INFO] return instance.@java.lang.Throwable::cause;
[INFO] }-*/;
[INFO]
[INFO] public Marshaller getMarshaller(String a0, String a1) {
[INFO] return marshallers.get(a1);
[INFO] }
[INFO] }
[INFO] **FIN**
[INFO] Rebinding org.jboss.errai.marshalling.client.api.MarshallerFactory
[INFO] Invoking generator
org.jboss.errai.marshalling.rebind.MarshallersGenerator
[INFO] Generating Marshallers Bootstrapper...
[INFO] **FIN**
[INFO] Rebinding org.jboss.errai.marshalling.client.api.MarshallerFactory
[INFO] Invoking generator
org.jboss.errai.marshalling.rebind.MarshallersGenerator
[INFO] Generating Marshallers Bootstrapper...
[INFO] **FIN**
[INFO] Rebinding org.jboss.errai.marshalling.client.api.MarshallerFactory
[INFO] Invoking generator
org.jboss.errai.marshalling.rebind.MarshallersGenerator
[INFO] Generating Marshallers Bootstrapper...
[INFO] **FIN**
[INFO] Rebinding org.jboss.errai.marshalling.client.api.MarshallerFactory
[INFO] Invoking generator
org.jboss.errai.marshalling.rebind.MarshallersGenerator
[INFO] Generating Marshallers Bootstrapper...
[INFO] **FIN**
[INFO] Rebinding org.jboss.errai.marshalling.client.api.MarshallerFactory
[INFO] Invoking generator
org.jboss.errai.marshalling.rebind.MarshallersGenerator
[INFO] Generating Marshallers Bootstrapper...
[INFO] **FIN**
[INFO] Scanning for additional dependencies:
<
http://hudson.qa.jboss.com/hudson/job/Errai/ws/errai-bus-demos/queryservi...
[INFO] Computing all possible rebind results for
'org.errai.samples.queryservice.client.local.QueryWidget.Binder'
[INFO] Rebinding org.errai.samples.queryservice.client.local.QueryWidget.Binder
[INFO] Invoking generator com.google.gwt.uibinder.rebind.UiBinderGenerator
[INFO] [WARN] Configuration property UiBinder.useSafeHtmlTemplates is
false! UiBinder SafeHtml integration is off, leaving your users more vulnerable to
cross-site scripting attacks. This property will default to true in future releases of
GWT.
[INFO] Scanning for additional dependencies:
jar:<http://hudson.qa.jboss.com/hudson/job/Errai/ws/errai-bus/target/e...
[INFO] Computing all possible rebind results for
'org.jboss.errai.bus.client.ext.ExtensionsLoader'
[INFO] Rebinding org.jboss.errai.bus.client.ext.ExtensionsLoader
[INFO] Invoking generator org.jboss.errai.bus.rebind.ExtensionProxyGenerator
[INFO] Generating Extensions Bootstrapper...
[INFO] Rebinding org.jboss.errai.bus.client.ext.ExtensionsLoader
[INFO] Invoking generator org.jboss.errai.bus.rebind.ExtensionProxyGenerator
[INFO] Generating Extensions Bootstrapper...
[INFO] Rebinding org.jboss.errai.bus.client.ext.ExtensionsLoader
[INFO] Invoking generator org.jboss.errai.bus.rebind.ExtensionProxyGenerator
[INFO] Generating Extensions Bootstrapper...
[INFO] Rebinding org.jboss.errai.bus.client.ext.ExtensionsLoader
[INFO] Invoking generator org.jboss.errai.bus.rebind.ExtensionProxyGenerator
[INFO] Generating Extensions Bootstrapper...
[INFO] Rebinding org.jboss.errai.bus.client.ext.ExtensionsLoader
[INFO] Invoking generator org.jboss.errai.bus.rebind.ExtensionProxyGenerator
[INFO] Generating Extensions Bootstrapper...
[INFO] Rebinding org.jboss.errai.bus.client.ext.ExtensionsLoader
[INFO] Invoking generator org.jboss.errai.bus.rebind.ExtensionProxyGenerator
[INFO] Generating Extensions Bootstrapper...
[INFO] [ERROR] An internal compiler exception occurred
[INFO] com.google.gwt.dev.jjs.InternalCompilerException: Failed to get JNode
[INFO] at com.google.gwt.dev.jjs.impl.TypeMap.get(TypeMap.java:139)
[INFO] at com.google.gwt.dev.jjs.impl.TypeMap.get(TypeMap.java:70)
[INFO] at com.google.gwt.dev.jjs.impl.BuildTypeMap.getType(BuildTypeMap.java:769)
[INFO] at com.google.gwt.dev.jjs.impl.BuildTypeMap.createField(BuildTypeMap.java:590)
[INFO] at com.google.gwt.dev.jjs.impl.BuildTypeMap.access$300(BuildTypeMap.java:101)
[INFO] at
com.google.gwt.dev.jjs.impl.BuildTypeMap$BuildDeclMapVisitor.visit(BuildTypeMap.java:185)
[INFO] at
org.eclipse.jdt.internal.compiler.ast.FieldDeclaration.traverse(FieldDeclaration.java:285)
[INFO] at
org.eclipse.jdt.internal.compiler.ast.TypeDeclaration.traverse(TypeDeclaration.java:1230)
[INFO] at
org.eclipse.jdt.internal.compiler.ast.CompilationUnitDeclaration.traverse(CompilationUnitDeclaration.java:687)
[INFO] at
com.google.gwt.dev.jjs.impl.BuildTypeMap.createPeersForNonTypeDecls(BuildTypeMap.java:674)
[INFO] at com.google.gwt.dev.jjs.impl.BuildTypeMap.exec(BuildTypeMap.java:539)
[INFO] at com.google.gwt.dev.jjs.impl.BuildTypeMap.exec(BuildTypeMap.java:529)
[INFO] at
com.google.gwt.dev.jjs.JavaToJavaScriptCompiler.precompile(JavaToJavaScriptCompiler.java:558)
[INFO] at
com.google.gwt.dev.jjs.JavaScriptCompiler.precompile(JavaScriptCompiler.java:35)
[INFO] at com.google.gwt.dev.Precompile.precompile(Precompile.java:538)
[INFO] at com.google.gwt.dev.Precompile.precompile(Precompile.java:492)
[INFO] at com.google.gwt.dev.Precompile.precompile(Precompile.java:405)
[INFO] at com.google.gwt.dev.Compiler.run(Compiler.java:215)
[INFO] at com.google.gwt.dev.Compiler.run(Compiler.java:187)
[INFO] at com.google.gwt.dev.Compiler$1.run(Compiler.java:159)
[INFO] at com.google.gwt.dev.CompileTaskRunner.doRun(CompileTaskRunner.java:87)
[INFO] at
com.google.gwt.dev.CompileTaskRunner.runWithAppropriateLogger(CompileTaskRunner.java:81)
[INFO] at com.google.gwt.dev.Compiler.main(Compiler.java:166)
[INFO] [ERROR] <no source info>: public interface org.slf4j.Logger
[INFO] extends java.lang.Object
[INFO] /* fields */
[INFO] public static final [unresolved] java.lang.String ROOT_LOGGER_NAME
[INFO] /* methods */
[INFO] [unresolved] public abstract void debug(java.lang.String)
[INFO] [unresolved] public abstract void debug(java.lang.String, java.lang.Object)
[INFO] [unresolved] public abstract void debug(java.lang.String, java.lang.Object[])
[INFO] [unresolved] public abstract void debug(java.lang.String, java.lang.Throwable)
[INFO] [unresolved] public abstract void debug(Unresolved type org.slf4j.Marker,
java.lang.String)
[INFO] [unresolved] public abstract void debug(java.lang.String, java.lang.Object,
java.lang.Object)
[INFO] [unresolved] public abstract void debug(Unresolved type org.slf4j.Marker,
java.lang.String, java.lang.Object)
[INFO] [unresolved] public abstract void debug(Unresolved type org.slf4j.Marker,
java.lang.String, java.lang.Object[])
[INFO] [unresolved] public abstract void debug(Unresolved type org.slf4j.Marker,
java.lang.String, java.lang.Throwable)
[INFO] [unresolved] public abstract void debug(Unresolved type org.slf4j.Marker,
java.lang.String, java.lang.Object, java.lang.Object)
[INFO] [unresolved] public abstract void error(java.lang.String)
[INFO] [unresolved] public abstract void error(java.lang.String, java.lang.Object)
[INFO] [unresolved] public abstract void error(java.lang.String, java.lang.Object[])
[INFO] [unresolved] public abstract void error(java.lang.String, java.lang.Throwable)
[INFO] [unresolved] public abstract void error(Unresolved type org.slf4j.Marker,
java.lang.String)
[INFO] [unresolved] public abstract void error(java.lang.String, java.lang.Object,
java.lang.Object)
[INFO] [unresolved] public abstract void error(Unresolved type org.slf4j.Marker,
java.lang.String, java.lang.Object)
[INFO] [unresolved] public abstract void error(Unresolved type org.slf4j.Marker,
java.lang.String, java.lang.Object[])
[INFO] [unresolved] public abstract void error(Unresolved type org.slf4j.Marker,
java.lang.String, java.lang.Throwable)
[INFO] [unresolved] public abstract void error(Unresolved type org.slf4j.Marker,
java.lang.String, java.lang.Object, java.lang.Object)
[INFO] [unresolved] public abstract java.lang.String getName()
[INFO] [unresolved] public abstract void info(java.lang.String)
[INFO] [unresolved] public abstract void info(java.lang.String, java.lang.Object)
[INFO] [unresolved] public abstract void info(java.lang.String, java.lang.Object[])
[INFO] [unresolved] public abstract void info(java.lang.String, java.lang.Throwable)
[INFO] [unresolved] public abstract void info(Unresolved type org.slf4j.Marker,
java.lang.String)
[INFO] [unresolved] public abstract void info(java.lang.String, java.lang.Object,
java.lang.Object)
[INFO] [unresolved] public abstract void info(Unresolved type org.slf4j.Marker,
java.lang.String, java.lang.Object)
[INFO] [unresolved] public abstract void info(Unresolved type org.slf4j.Marker,
java.lang.String, java.lang.Object[])
[INFO] [unresolved] public abstract void info(Unresolved type org.slf4j.Marker,
java.lang.String, java.lang.Throwable)
[INFO] [unresolved] public abstract void info(Unresolved type org.slf4j.Marker,
java.lang.String, java.lang.Object, java.lang.Object)
[INFO] [unresolved] public abstract boolean isDebugEnabled()
[INFO] [unresolved] public abstract boolean isDebugEnabled(Unresolved type
org.slf4j.Marker)
[INFO] [unresolved] public abstract boolean isErrorEnabled()
[INFO] [unresolved] public abstract boolean isErrorEnabled(Unresolved type
org.slf4j.Marker)
[INFO] [unresolved] public abstract boolean isInfoEnabled()
[INFO] [unresolved] public abstract boolean isInfoEnabled(Unresolved type
org.slf4j.Marker)
[INFO] [unresolved] public abstract boolean isTraceEnabled()
[INFO] [unresolved] public abstract boolean isTraceEnabled(Unresolved type
org.slf4j.Marker)
[INFO] [unresolved] public abstract boolean isWarnEnabled()
[INFO] [unresolved] public abstract boolean isWarnEnabled(Unresolved type
org.slf4j.Marker)
[INFO] [unresolved] public abstract void trace(java.lang.String)
[INFO] [unresolved] public abstract void trace(java.lang.String, java.lang.Object)
[INFO] [unresolved] public abstract void trace(java.lang.String, java.lang.Object[])
[INFO] [unresolved] public abstract void trace(java.lang.String, java.lang.Throwable)
[INFO] [unresolved] public abstract void trace(Unresolved type org.slf4j.Marker,
java.lang.String)
[INFO] [unresolved] public abstract void trace(java.lang.String, java.lang.Object,
java.lang.Object)
[INFO] [unresolved] public abstract void trace(Unresolved type org.slf4j.Marker,
java.lang.String, java.lang.Object)
[INFO] [unresolved] public abstract void trace(Unresolved type org.slf4j.Marker,
java.lang.String, java.lang.Object[])
[INFO] [unresolved] public abstract void trace(Unresolved type org.slf4j.Marker,
java.lang.String, java.lang.Throwable)
[INFO] [unresolved] public abstract void trace(Unresolved type org.slf4j.Marker,
java.lang.String, java.lang.Object, java.lang.Object)
[INFO] public abstract void warn(java.lang.String)
[INFO] [unresolved] public abstract void warn(java.lang.String, java.lang.Object)
[INFO] [unresolved] public abstract void warn(java.lang.String, java.lang.Object[])
[INFO] [unresolved] public abstract void warn(java.lang.String, java.lang.Throwable)
[INFO] [unresolved] public abstract void warn(Unresolved type org.slf4j.Marker,
java.lang.String)
[INFO] [unresolved] public abstract void warn(java.lang.String, java.lang.Object,
java.lang.Object)
[INFO] [unresolved] public abstract void warn(Unresolved type org.slf4j.Marker,
java.lang.String, java.lang.Object)
[INFO] [unresolved] public abstract void warn(Unresolved type org.slf4j.Marker,
java.lang.String, java.lang.Object[])
[INFO] [unresolved] public abstract void warn(Unresolved type org.slf4j.Marker,
java.lang.String, java.lang.Throwable)
[INFO] [unresolved] public abstract void warn(Unresolved type org.slf4j.Marker,
java.lang.String, java.lang.Object, java.lang.Object)
[INFO]
[INFO]
[INFO]
[INFO] org.eclipse.jdt.internal.compiler.lookup.BinaryTypeBinding
[INFO] [ERROR] at ErrorHelper.java(33): private static final Logger log =
getLogger(ErrorHelper.class);
[INFO] org.eclipse.jdt.internal.compiler.ast.FieldDeclaration
mojoFailed org.codehaus.mojo:gwt-maven-plugin:2.3.0(default)
projectFailed org.jboss.errai:errai-bus-demos-queryservice:2.0-SNAPSHOT
[JENKINS] Archiving
<
http://hudson.qa.jboss.com/hudson/job/Errai/ws/errai-bus-demos/queryservi...
to
/qa/hudson_master/hudson_home/hudson_workspace/jobs/Errai/modules/org.jboss.errai$errai-bus-demos-queryservice/builds/2011-10-13_19-36-49/archive/org.jboss.errai/errai-bus-demos-queryservice/2.0-SNAPSHOT/errai-bus-demos-queryservice-2.0-SNAPSHOT.pom
sessionEnded
[INFO] ------------------------------------------------------------------------
[INFO] Reactor Summary:
[INFO]
[INFO] Errai ............................................. SUCCESS [2.517s]
[INFO] Errai::Common ..................................... SUCCESS [7.157s]
[INFO] errai-codegen ..................................... SUCCESS [15.301s]
[INFO] Errai Marshalling ................................. SUCCESS [5.766s]
[INFO] Errai::Bus ........................................ SUCCESS [3:05.365s]
[INFO] Errai IOC ......................................... SUCCESS [50.239s]
[INFO] Errai::Widgets .................................... SUCCESS [4.823s]
[INFO] Errai::Persistence ................................ SUCCESS [19.583s]
[INFO] Errai::Tools ...................................... SUCCESS [9.015s]
[INFO] Errai::Bus::Demos ................................. SUCCESS [0.287s]
[INFO] Errai::Bus::Demos::AsyncDemo ...................... SUCCESS [1:45.870s]
[INFO] Errai::Bus::Demos::ClientService .................. SUCCESS [1:46.990s]
[INFO] Errai::Bus::Demos::HelloWorld ..................... SUCCESS [1:49.471s]
[INFO] Errai::Bus::Demos::QueryService ................... FAILURE [42.285s]
[INFO] Errai::Bus::Demos::Serialization .................. SKIPPED
[INFO] Errai::Bus::Demos::RPCDemo ........................ SKIPPED
[INFO] Errai::Bus::Demos::StockDemo ...................... SKIPPED
[INFO] jboss7-support .................................... SKIPPED
[INFO] Errai::Reference::Guide ........................... SKIPPED
[INFO] Errai::Quickstart::Guide .......................... SKIPPED
[INFO] Errai::Distribution ............................... SKIPPED
[INFO] ------------------------------------------------------------------------
[INFO] BUILD FAILURE
[INFO] ------------------------------------------------------------------------
[INFO] Total time: 11:18.841s
[INFO] Finished at: Thu Oct 13 19:48:14 EDT 2011
[INFO] Final Memory: 149M/454M
[INFO] ------------------------------------------------------------------------
maven builder waiting
mavenExecutionResult exceptions not empty
org.apache.maven.lifecycle.LifecycleExecutionException: Failed to execute goal
org.codehaus.mojo:gwt-maven-plugin:2.3.0:compile (default) on project
errai-bus-demos-queryservice: Command [[
/bin/sh -c /qa/tools/opt/x86_64/jdk1.6.0_24/jre/bin/java -Xmx512m -classpath
<
http://hudson.qa.jboss.com/hudson/job/Errai/ws/errai-bus-demos/queryservi...
com.google.gwt.dev.Compiler -gen
<
http://hudson.qa.jboss.com/hudson/job/Errai/ws/errai-bus-demos/queryservi...
-logLevel INFO -style OBF -war
<
http://hudson.qa.jboss.com/hudson/job/Errai/ws/errai-bus-demos/queryservi...
-localWorkers 4 org.errai.samples.queryservice.QueryService
]] failed with status 1
at org.apache.maven.lifecycle.internal.MojoExecutor.execute(MojoExecutor.java:217)
at org.apache.maven.lifecycle.internal.MojoExecutor.execute(MojoExecutor.java:153)
at org.apache.maven.lifecycle.internal.MojoExecutor.execute(MojoExecutor.java:145)
at
org.apache.maven.lifecycle.internal.LifecycleModuleBuilder.buildProject(LifecycleModuleBuilder.java:84)
at
org.apache.maven.lifecycle.internal.LifecycleModuleBuilder.buildProject(LifecycleModuleBuilder.java:59)
at
org.apache.maven.lifecycle.internal.LifecycleStarter.singleThreadedBuild(LifecycleStarter.java:183)
at
org.apache.maven.lifecycle.internal.LifecycleStarter.execute(LifecycleStarter.java:161)
at org.apache.maven.DefaultMaven.doExecute(DefaultMaven.java:319)
at org.apache.maven.DefaultMaven.execute(DefaultMaven.java:156)
at org.jvnet.hudson.maven3.launcher.Maven3Launcher.main(Maven3Launcher.java:79)
at sun.reflect.NativeMethodAccessorImpl.invoke0(Native Method)
at sun.reflect.NativeMethodAccessorImpl.invoke(NativeMethodAccessorImpl.java:39)
at sun.reflect.DelegatingMethodAccessorImpl.invoke(DelegatingMethodAccessorImpl.java:25)
at java.lang.reflect.Method.invoke(Method.java:597)
at org.codehaus.plexus.classworlds.launcher.Launcher.launchStandard(Launcher.java:329)
at org.codehaus.plexus.classworlds.launcher.Launcher.launch(Launcher.java:239)
at org.jvnet.hudson.maven3.agent.Maven3Main.launch(Maven3Main.java:146)
at hudson.maven.Maven3Builder.call(Maven3Builder.java:127)
at hudson.maven.Maven3Builder.call(Maven3Builder.java:74)
at hudson.remoting.UserRequest.perform(UserRequest.java:114)
at hudson.remoting.UserRequest.perform(UserRequest.java:48)
at hudson.remoting.Request$2.run(Request.java:270)
at java.util.concurrent.Executors$RunnableAdapter.call(Executors.java:441)
at java.util.concurrent.FutureTask$Sync.innerRun(FutureTask.java:303)
at java.util.concurrent.FutureTask.run(FutureTask.java:138)
at java.util.concurrent.ThreadPoolExecutor$Worker.runTask(ThreadPoolExecutor.java:886)
at java.util.concurrent.ThreadPoolExecutor$Worker.run(ThreadPoolExecutor.java:908)
at java.lang.Thread.run(Thread.java:662)
Caused by: org.codehaus.mojo.gwt.shell.ForkedProcessExecutionException: Command [[
/bin/sh -c /qa/tools/opt/x86_64/jdk1.6.0_24/jre/bin/java -Xmx512m -classpath
<
http://hudson.qa.jboss.com/hudson/job/Errai/ws/errai-bus-demos/queryservi...
com.google.gwt.dev.Compiler -gen
<
http://hudson.qa.jboss.com/hudson/job/Errai/ws/errai-bus-demos/queryservi...
-logLevel INFO -style OBF -war
<
http://hudson.qa.jboss.com/hudson/job/Errai/ws/errai-bus-demos/queryservi...
-localWorkers 4 org.errai.samples.queryservice.QueryService
]] failed with status 1
at
org.codehaus.mojo.gwt.shell.AbstractGwtShellMojo$JavaCommand.execute(AbstractGwtShellMojo.java:422)
at org.codehaus.mojo.gwt.shell.CompileMojo.compile(CompileMojo.java:301)
at org.codehaus.mojo.gwt.shell.CompileMojo.doExecute(CompileMojo.java:224)
at
org.codehaus.mojo.gwt.shell.AbstractGwtShellMojo.execute(AbstractGwtShellMojo.java:134)
at
org.apache.maven.plugin.DefaultBuildPluginManager.executeMojo(DefaultBuildPluginManager.java:101)
at org.apache.maven.lifecycle.internal.MojoExecutor.execute(MojoExecutor.java:209)
... 27 more
Maven failed with error.
Sending e-mails to: errai-dev(a)lists.jboss.org
Sending e-mails to: errai-dev(a)lists.jboss.org
channel stopped