See
<
http://jenkins.mw.lab.eng.bos.redhat.com/hudson/job/jbosstools-openshift_...
------------------------------------------
[...truncated 2197 lines...]
[INFO] --- jacoco-maven-plugin:0.7.1.201405082137:prepare-agent (default) @
org.jboss.tools.openshift.cdk.feature ---
[INFO] argLine set to
-javaagent:<http://jenkins.mw.lab.eng.bos.redhat.com/hudson/job/jbosstools-openshift_master/ws/.repository/org/jacoco/org.jacoco.agent/0.7.1.201405082137/org.jacoco.agent-0.7.1.201405082137-runtime.jar=destfile=/mnt/hudson_workspace/workspace/jbosstools-openshift_master/sources/target/jacoco.exec,append=true,includes=org.jboss.tools.*>
[INFO]
[INFO] --- tycho-source-plugin:0.26.0:plugin-source (plugin-source) @
org.jboss.tools.openshift.cdk.feature ---
[INFO]
[INFO] --- target-platform-configuration:0.26.0:target-platform (default-target-platform)
@ org.jboss.tools.openshift.cdk.feature ---
[INFO]
[INFO] --- tycho-packaging-plugin:0.26.0:package-feature (default-package-feature) @
org.jboss.tools.openshift.cdk.feature ---
[INFO]
[INFO] ------------------------------------------------------------------------
[INFO] Building org.jboss.tools.openshift.cdk.test.feature 3.3.1-SNAPSHOT
[INFO] ------------------------------------------------------------------------
[INFO]
[INFO] --- maven-clean-plugin:2.6.1:clean (default-clean) @
org.jboss.tools.openshift.cdk.test.feature ---
[INFO] Deleting
<
http://jenkins.mw.lab.eng.bos.redhat.com/hudson/job/jbosstools-openshift_...
[INFO]
[INFO] --- tycho-packaging-plugin:0.26.0:build-qualifier-aggregator
(default-build-qualifier-aggregator) @ org.jboss.tools.openshift.cdk.test.feature ---
[INFO] The project's OSGi version is 3.3.1.v20160928-2042
[INFO]
[INFO] --- tycho-packaging-plugin:0.26.0:validate-id (default-validate-id) @
org.jboss.tools.openshift.cdk.test.feature ---
[INFO]
[INFO] --- tycho-packaging-plugin:0.26.0:validate-version (default-validate-version) @
org.jboss.tools.openshift.cdk.test.feature ---
[INFO]
[INFO] --- build-helper-maven-plugin:1.7:regex-property (regex-property) @
org.jboss.tools.openshift.cdk.test.feature ---
[INFO] Setting property 'skipTestsOrITests' to 'true'.
[INFO]
[INFO] --- maven-enforcer-plugin:1.4.1:enforce (core-has-ui-deps) @
org.jboss.tools.openshift.cdk.test.feature ---
[INFO]
[INFO] --- maven-enforcer-plugin:1.4.1:enforce (warn-no-snapshots-AMx) @
org.jboss.tools.openshift.cdk.test.feature ---
[INFO]
[INFO] --- maven-enforcer-plugin:1.4.1:enforce (enforce-no-snapshots-Final) @
org.jboss.tools.openshift.cdk.test.feature ---
[INFO]
[INFO] --- jacoco-maven-plugin:0.7.1.201405082137:prepare-agent (default) @
org.jboss.tools.openshift.cdk.test.feature ---
[INFO] argLine set to
-javaagent:<http://jenkins.mw.lab.eng.bos.redhat.com/hudson/job/jbosstools-openshift_master/ws/.repository/org/jacoco/org.jacoco.agent/0.7.1.201405082137/org.jacoco.agent-0.7.1.201405082137-runtime.jar=destfile=/mnt/hudson_workspace/workspace/jbosstools-openshift_master/sources/target/jacoco.exec,append=true,includes=org.jboss.tools.*>
[INFO]
[INFO] --- tycho-source-plugin:0.26.0:plugin-source (plugin-source) @
org.jboss.tools.openshift.cdk.test.feature ---
[INFO]
[INFO] --- target-platform-configuration:0.26.0:target-platform (default-target-platform)
@ org.jboss.tools.openshift.cdk.test.feature ---
[INFO]
[INFO] --- tycho-packaging-plugin:0.26.0:package-feature (default-package-feature) @
org.jboss.tools.openshift.cdk.test.feature ---
[INFO] Building jar:
<
http://jenkins.mw.lab.eng.bos.redhat.com/hudson/job/jbosstools-openshift_...
[INFO]
[INFO] --- tycho-p2-plugin:0.26.0:p2-metadata-default (default-p2-metadata-default) @
org.jboss.tools.openshift.cdk.test.feature ---
[INFO]
[INFO] --- tycho-p2-plugin:0.26.0:feature-p2-metadata (default-feature-p2-metadata) @
org.jboss.tools.openshift.cdk.test.feature ---
[INFO]
[INFO] --- repository-utils:0.26.1-SNAPSHOT:generate-repository-facade (generate-facade) @
org.jboss.tools.openshift.cdk.test.feature ---
[INFO]
[INFO] --- tycho-pack200a-plugin:0.26.0:normalize (pack200-normalize) @
org.jboss.tools.openshift.cdk.test.feature ---
[INFO]
[INFO] --- exec-maven-plugin:1.2.1:exec (jarsign) @
org.jboss.tools.openshift.cdk.test.feature ---
[INFO] skipping execute as per configuraion
[INFO]
[INFO] --- tycho-pack200b-plugin:0.26.0:pack (pack200-pack) @
org.jboss.tools.openshift.cdk.test.feature ---
[INFO]
[INFO] --- tycho-source-feature-plugin:0.26.0:source-feature (source-feature) @
org.jboss.tools.openshift.cdk.test.feature ---
[INFO] Building jar:
<
http://jenkins.mw.lab.eng.bos.redhat.com/hudson/job/jbosstools-openshift_...
[INFO]
[INFO] --- tycho-p2-plugin:0.26.0:p2-metadata (attached-p2-metadata) @
org.jboss.tools.openshift.cdk.test.feature ---
[INFO] No baseline version MavenProject:
org.jboss.tools.openshift.features:org.jboss.tools.openshift.cdk.test.feature:3.3.1-SNAPSHOT
@
<
http://jenkins.mw.lab.eng.bos.redhat.com/hudson/job/jbosstools-openshift_...
[INFO]
[INFO] --- tycho-p2-plugin:0.26.0:p2-metadata (p2-metadata) @
org.jboss.tools.openshift.cdk.test.feature ---
[INFO] No baseline version MavenProject:
org.jboss.tools.openshift.features:org.jboss.tools.openshift.cdk.test.feature:3.3.1-SNAPSHOT
@
<
http://jenkins.mw.lab.eng.bos.redhat.com/hudson/job/jbosstools-openshift_...
[INFO]
[INFO] --- tycho-p2-extras-plugin:0.26.0:compare-version-with-baselines (default) @
org.jboss.tools.openshift.cdk.test.feature ---
[INFO]
[INFO] --- maven-install-plugin:2.3.1:install (default-install) @
org.jboss.tools.openshift.cdk.test.feature ---
[INFO] Installing
<
http://jenkins.mw.lab.eng.bos.redhat.com/hudson/job/jbosstools-openshift_...
to
<
http://jenkins.mw.lab.eng.bos.redhat.com/hudson/job/jbosstools-openshift_...
[INFO] Installing
<
http://jenkins.mw.lab.eng.bos.redhat.com/hudson/job/jbosstools-openshift_...
to
<
http://jenkins.mw.lab.eng.bos.redhat.com/hudson/job/jbosstools-openshift_...
[INFO] Installing
<
http://jenkins.mw.lab.eng.bos.redhat.com/hudson/job/jbosstools-openshift_...
to
<
http://jenkins.mw.lab.eng.bos.redhat.com/hudson/job/jbosstools-openshift_...
[INFO] Installing
<
http://jenkins.mw.lab.eng.bos.redhat.com/hudson/job/jbosstools-openshift_...
to
<
http://jenkins.mw.lab.eng.bos.redhat.com/hudson/job/jbosstools-openshift_...
[INFO] Installing
<
http://jenkins.mw.lab.eng.bos.redhat.com/hudson/job/jbosstools-openshift_...
to
<
http://jenkins.mw.lab.eng.bos.redhat.com/hudson/job/jbosstools-openshift_...
[INFO] Installing
<
http://jenkins.mw.lab.eng.bos.redhat.com/hudson/job/jbosstools-openshift_...
to
<
http://jenkins.mw.lab.eng.bos.redhat.com/hudson/job/jbosstools-openshift_...
[INFO] Installing
<
http://jenkins.mw.lab.eng.bos.redhat.com/hudson/job/jbosstools-openshift_...
to
<
http://jenkins.mw.lab.eng.bos.redhat.com/hudson/job/jbosstools-openshift_...
[INFO]
[INFO] --- tycho-p2-plugin:0.26.0:update-local-index (default-update-local-index) @
org.jboss.tools.openshift.cdk.test.feature ---
[INFO]
[INFO] ------------------------------------------------------------------------
[INFO] Building org.jboss.tools.openshift.js.feature 1.0.0-SNAPSHOT
[INFO] ------------------------------------------------------------------------
[INFO]
[INFO] --- maven-clean-plugin:2.6.1:clean (default-clean) @
org.jboss.tools.openshift.js.feature ---
[INFO] Deleting
<
http://jenkins.mw.lab.eng.bos.redhat.com/hudson/job/jbosstools-openshift_...
[INFO]
[INFO] --- tycho-packaging-plugin:0.26.0:build-qualifier-aggregator
(default-build-qualifier-aggregator) @ org.jboss.tools.openshift.js.feature ---
[INFO] The project's OSGi version is 1.0.0.v20161116-1518
[INFO]
[INFO] --- tycho-packaging-plugin:0.26.0:validate-id (default-validate-id) @
org.jboss.tools.openshift.js.feature ---
[INFO]
[INFO] --- tycho-packaging-plugin:0.26.0:validate-version (default-validate-version) @
org.jboss.tools.openshift.js.feature ---
[INFO]
[INFO] --- build-helper-maven-plugin:1.7:regex-property (regex-property) @
org.jboss.tools.openshift.js.feature ---
[INFO] Setting property 'skipTestsOrITests' to 'true'.
[INFO]
[INFO] --- maven-enforcer-plugin:1.4.1:enforce (core-has-ui-deps) @
org.jboss.tools.openshift.js.feature ---
[INFO]
[INFO] --- maven-enforcer-plugin:1.4.1:enforce (warn-no-snapshots-AMx) @
org.jboss.tools.openshift.js.feature ---
[INFO]
[INFO] --- maven-enforcer-plugin:1.4.1:enforce (enforce-no-snapshots-Final) @
org.jboss.tools.openshift.js.feature ---
[INFO]
[INFO] --- jacoco-maven-plugin:0.7.1.201405082137:prepare-agent (default) @
org.jboss.tools.openshift.js.feature ---
[INFO] argLine set to
-javaagent:<http://jenkins.mw.lab.eng.bos.redhat.com/hudson/job/jbosstools-openshift_master/ws/.repository/org/jacoco/org.jacoco.agent/0.7.1.201405082137/org.jacoco.agent-0.7.1.201405082137-runtime.jar=destfile=/mnt/hudson_workspace/workspace/jbosstools-openshift_master/sources/target/jacoco.exec,append=true,includes=org.jboss.tools.*>
[INFO]
[INFO] --- tycho-source-plugin:0.26.0:plugin-source (plugin-source) @
org.jboss.tools.openshift.js.feature ---
[INFO]
[INFO] --- target-platform-configuration:0.26.0:target-platform (default-target-platform)
@ org.jboss.tools.openshift.js.feature ---
[INFO]
[INFO] --- tycho-packaging-plugin:0.26.0:package-feature (default-package-feature) @
org.jboss.tools.openshift.js.feature ---
[INFO] Building jar:
<
http://jenkins.mw.lab.eng.bos.redhat.com/hudson/job/jbosstools-openshift_...
[INFO]
[INFO] --- tycho-p2-plugin:0.26.0:p2-metadata-default (default-p2-metadata-default) @
org.jboss.tools.openshift.js.feature ---
[INFO]
[INFO] --- tycho-p2-plugin:0.26.0:feature-p2-metadata (default-feature-p2-metadata) @
org.jboss.tools.openshift.js.feature ---
[INFO]
[INFO] --- repository-utils:0.26.1-SNAPSHOT:generate-repository-facade (generate-facade) @
org.jboss.tools.openshift.js.feature ---
[INFO]
[INFO] --- tycho-pack200a-plugin:0.26.0:normalize (pack200-normalize) @
org.jboss.tools.openshift.js.feature ---
[INFO]
[INFO] --- exec-maven-plugin:1.2.1:exec (jarsign) @ org.jboss.tools.openshift.js.feature
---
[INFO] skipping execute as per configuraion
[INFO]
[INFO] --- tycho-pack200b-plugin:0.26.0:pack (pack200-pack) @
org.jboss.tools.openshift.js.feature ---
[INFO]
[INFO] --- tycho-source-feature-plugin:0.26.0:source-feature (source-feature) @
org.jboss.tools.openshift.js.feature ---
[INFO] Building jar:
<
http://jenkins.mw.lab.eng.bos.redhat.com/hudson/job/jbosstools-openshift_...
[INFO]
[INFO] --- tycho-p2-plugin:0.26.0:p2-metadata (attached-p2-metadata) @
org.jboss.tools.openshift.js.feature ---
[INFO] No baseline version MavenProject:
org.jboss.tools.openshift.features:org.jboss.tools.openshift.js.feature:1.0.0-SNAPSHOT @
<
http://jenkins.mw.lab.eng.bos.redhat.com/hudson/job/jbosstools-openshift_...
[INFO]
[INFO] --- tycho-p2-plugin:0.26.0:p2-metadata (p2-metadata) @
org.jboss.tools.openshift.js.feature ---
[INFO] No baseline version MavenProject:
org.jboss.tools.openshift.features:org.jboss.tools.openshift.js.feature:1.0.0-SNAPSHOT @
<
http://jenkins.mw.lab.eng.bos.redhat.com/hudson/job/jbosstools-openshift_...
[INFO]
[INFO] --- tycho-p2-extras-plugin:0.26.0:compare-version-with-baselines (default) @
org.jboss.tools.openshift.js.feature ---
[INFO]
[INFO] --- maven-install-plugin:2.3.1:install (default-install) @
org.jboss.tools.openshift.js.feature ---
[INFO] Installing
<
http://jenkins.mw.lab.eng.bos.redhat.com/hudson/job/jbosstools-openshift_...
to
<
http://jenkins.mw.lab.eng.bos.redhat.com/hudson/job/jbosstools-openshift_...
[INFO] Installing
<
http://jenkins.mw.lab.eng.bos.redhat.com/hudson/job/jbosstools-openshift_...
to
<
http://jenkins.mw.lab.eng.bos.redhat.com/hudson/job/jbosstools-openshift_...
[INFO] Installing
<
http://jenkins.mw.lab.eng.bos.redhat.com/hudson/job/jbosstools-openshift_...
to
<
http://jenkins.mw.lab.eng.bos.redhat.com/hudson/job/jbosstools-openshift_...
[INFO] Installing
<
http://jenkins.mw.lab.eng.bos.redhat.com/hudson/job/jbosstools-openshift_...
to
<
http://jenkins.mw.lab.eng.bos.redhat.com/hudson/job/jbosstools-openshift_...
[INFO] Installing
<
http://jenkins.mw.lab.eng.bos.redhat.com/hudson/job/jbosstools-openshift_...
to
<
http://jenkins.mw.lab.eng.bos.redhat.com/hudson/job/jbosstools-openshift_...
[INFO] Installing
<
http://jenkins.mw.lab.eng.bos.redhat.com/hudson/job/jbosstools-openshift_...
to
<
http://jenkins.mw.lab.eng.bos.redhat.com/hudson/job/jbosstools-openshift_...
[INFO] Installing
<
http://jenkins.mw.lab.eng.bos.redhat.com/hudson/job/jbosstools-openshift_...
to
<
http://jenkins.mw.lab.eng.bos.redhat.com/hudson/job/jbosstools-openshift_...
[INFO]
[INFO] --- tycho-p2-plugin:0.26.0:update-local-index (default-update-local-index) @
org.jboss.tools.openshift.js.feature ---
[INFO]
[INFO] ------------------------------------------------------------------------
[INFO] Skipping openshift.site
[INFO] This project has been banned from the build due to previous failures.
[INFO] ------------------------------------------------------------------------
[INFO] ------------------------------------------------------------------------
[INFO] Reactor Summary:
[INFO]
[INFO] jbosstools-openshift ............................... SUCCESS [02:09 min]
[INFO] openshift.plugins .................................. SUCCESS [ 0.063 s]
[INFO] org.jboss.tools.openshift.egit.core ................ SUCCESS [ 23.815 s]
[INFO] org.jboss.tools.openshift.egit.ui .................. SUCCESS [ 4.138 s]
[INFO] org.jboss.tools.openshift.express.client ........... SUCCESS [ 12.172 s]
[INFO] org.jboss.tools.openshift.common.core .............. SUCCESS [ 6.767 s]
[INFO] org.jboss.tools.openshift.express.core ............. SUCCESS [ 5.960 s]
[INFO] org.jboss.tools.openshift.common.ui ................ SUCCESS [ 7.695 s]
[INFO] org.jboss.tools.openshift.express.ui ............... SUCCESS [ 13.023 s]
[INFO] org.jboss.tools.openshift.client ................... SUCCESS [ 1.656 s]
[INFO] org.jboss.tools.openshift.core ..................... SUCCESS [ 6.350 s]
[INFO] org.jboss.tools.openshift.ui ....................... SUCCESS [ 15.945 s]
[INFO] org.jboss.tools.openshift.cdk.server ............... SUCCESS [02:04 min]
[INFO] org.jboss.tools.openshift.js ....................... SUCCESS [ 1.374 s]
[INFO] openshift.tests .................................... SUCCESS [ 0.051 s]
[INFO] org.jboss.tools.openshift.egit.test ................ SUCCESS [ 1.328 s]
[INFO] org.jboss.tools.openshift.express.test ............. SUCCESS [ 1.997 s]
[INFO] org.jboss.tools.openshift.test ..................... SUCCESS [ 4.198 s]
[INFO] org.jboss.tools.openshift.cdk.server.test .......... SUCCESS [ 2.020 s]
[INFO] openshift.features ................................. SUCCESS [ 0.063 s]
[INFO] org.jboss.tools.openshift.feature .................. SUCCESS [ 0.845 s]
[INFO] org.jboss.tools.openshift.test.feature ............. SUCCESS [ 0.823 s]
[INFO] org.jboss.tools.openshift.egit.integration.feature . SUCCESS [ 0.506 s]
[INFO] org.jboss.tools.openshift.egit.integration.test.feature SUCCESS [ 0.615 s]
[INFO] org.jboss.tools.openshift.express.feature .......... SUCCESS [ 0.553 s]
[INFO] org.jboss.tools.openshift.express.test.feature ..... SUCCESS [ 0.488 s]
[INFO] org.jboss.tools.openshift.cdk.feature .............. FAILURE [ 0.434 s]
[INFO] org.jboss.tools.openshift.cdk.test.feature ......... SUCCESS [ 0.532 s]
[INFO] org.jboss.tools.openshift.js.feature ............... SUCCESS [ 0.430 s]
[INFO] openshift.site ..................................... SKIPPED
[INFO] ------------------------------------------------------------------------
[INFO] BUILD FAILURE
[INFO] ------------------------------------------------------------------------
[INFO] Total time: 11:40 min
[INFO] Finished at: 2016-12-07T04:23:58-05:00
[INFO] Final Memory: 147M/695M
[INFO] ------------------------------------------------------------------------
[ERROR] Failed to execute goal
org.eclipse.tycho:tycho-packaging-plugin:0.26.0:package-feature (default-package-feature)
on project org.jboss.tools.openshift.cdk.feature: Execution default-package-feature of
goal org.eclipse.tycho:tycho-packaging-plugin:0.26.0:package-feature failed: Could not
determine installation size of file
<
http://jenkins.mw.lab.eng.bos.redhat.com/hudson/job/jbosstools-openshift_...;:
error in opening zip file -> [Help 1]
org.apache.maven.lifecycle.LifecycleExecutionException: Failed to execute goal
org.eclipse.tycho:tycho-packaging-plugin:0.26.0:package-feature (default-package-feature)
on project org.jboss.tools.openshift.cdk.feature: Execution default-package-feature of
goal org.eclipse.tycho:tycho-packaging-plugin:0.26.0:package-feature failed: Could not
determine installation size of file
<
http://jenkins.mw.lab.eng.bos.redhat.com/hudson/job/jbosstools-openshift_...
at org.apache.maven.lifecycle.internal.MojoExecutor.execute(MojoExecutor.java:224)
at org.apache.maven.lifecycle.internal.MojoExecutor.execute(MojoExecutor.java:153)
at org.apache.maven.lifecycle.internal.MojoExecutor.execute(MojoExecutor.java:145)
at
org.apache.maven.lifecycle.internal.LifecycleModuleBuilder.buildProject(LifecycleModuleBuilder.java:116)
at
org.apache.maven.lifecycle.internal.LifecycleModuleBuilder.buildProject(LifecycleModuleBuilder.java:80)
at
org.apache.maven.lifecycle.internal.builder.singlethreaded.SingleThreadedBuilder.build(SingleThreadedBuilder.java:51)
at
org.apache.maven.lifecycle.internal.LifecycleStarter.execute(LifecycleStarter.java:128)
at org.apache.maven.DefaultMaven.doExecute(DefaultMaven.java:307)
at org.apache.maven.DefaultMaven.doExecute(DefaultMaven.java:193)
at org.apache.maven.DefaultMaven.execute(DefaultMaven.java:106)
at org.apache.maven.cli.MavenCli.execute(MavenCli.java:862)
at org.apache.maven.cli.MavenCli.doMain(MavenCli.java:286)
at org.apache.maven.cli.MavenCli.main(MavenCli.java:197)
at sun.reflect.NativeMethodAccessorImpl.invoke0(Native Method)
at sun.reflect.NativeMethodAccessorImpl.invoke(NativeMethodAccessorImpl.java:62)
at sun.reflect.DelegatingMethodAccessorImpl.invoke(DelegatingMethodAccessorImpl.java:43)
at java.lang.reflect.Method.invoke(Method.java:498)
at org.codehaus.plexus.classworlds.launcher.Launcher.launchEnhanced(Launcher.java:289)
at org.codehaus.plexus.classworlds.launcher.Launcher.launch(Launcher.java:229)
at org.codehaus.plexus.classworlds.launcher.Launcher.mainWithExitCode(Launcher.java:415)
at org.codehaus.plexus.classworlds.launcher.Launcher.main(Launcher.java:356)
Caused by: org.apache.maven.plugin.PluginExecutionException: Execution
default-package-feature of goal
org.eclipse.tycho:tycho-packaging-plugin:0.26.0:package-feature failed: Could not
determine installation size of file
<
http://jenkins.mw.lab.eng.bos.redhat.com/hudson/job/jbosstools-openshift_...
at
org.apache.maven.plugin.DefaultBuildPluginManager.executeMojo(DefaultBuildPluginManager.java:145)
at org.apache.maven.lifecycle.internal.MojoExecutor.execute(MojoExecutor.java:208)
... 20 more
Caused by: java.lang.RuntimeException: Could not determine installation size of file
<
http://jenkins.mw.lab.eng.bos.redhat.com/hudson/job/jbosstools-openshift_...
at
org.eclipse.tycho.packaging.FeatureXmlTransformer.getInstallSize(FeatureXmlTransformer.java:139)
at
org.eclipse.tycho.packaging.FeatureXmlTransformer.setDownloadAndInstallSize(FeatureXmlTransformer.java:109)
at
org.eclipse.tycho.packaging.FeatureXmlTransformer.expandReferences(FeatureXmlTransformer.java:64)
at
org.eclipse.tycho.packaging.PackageFeatureMojo.expandVersionQualifiers(PackageFeatureMojo.java:254)
at org.eclipse.tycho.packaging.PackageFeatureMojo.execute(PackageFeatureMojo.java:125)
at
org.apache.maven.plugin.DefaultBuildPluginManager.executeMojo(DefaultBuildPluginManager.java:134)
... 21 more
Caused by: java.util.zip.ZipException: error in opening zip file
at java.util.zip.ZipFile.open(Native Method)
at java.util.zip.ZipFile.<init>(ZipFile.java:219)
at java.util.zip.ZipFile.<init>(ZipFile.java:149)
at java.util.jar.JarFile.<init>(JarFile.java:166)
at java.util.jar.JarFile.<init>(JarFile.java:130)
at
org.eclipse.tycho.packaging.FeatureXmlTransformer.getInstallSize(FeatureXmlTransformer.java:125)
... 26 more
[ERROR]
[ERROR] Re-run Maven using the -X switch to enable full debug logging.
[ERROR]
[ERROR] For more information about the errors and possible solutions, please read the
following articles:
[ERROR] [Help 1]
http://cwiki.apache.org/confluence/display/MAVEN/PluginExecutionException
[ERROR]
[ERROR] After correcting the problems, you can resume the build with the command
[ERROR] mvn <goals> -rf :org.jboss.tools.openshift.cdk.feature
Build step 'Invoke top-level Maven targets' marked build as failure
Terminating xvnc.
$ vncserver -kill :59
Killing Xvnc process ID 28830
Checking console output
Archiving artifacts
Recording test results
ERROR: Publisher 'Publish JUnit test result report' failed: No test report files
were found. Configuration error?
[description-setter] Description set: