See
<
https://studio-jenkins-csb-codeready.cloud.paas.psi.redhat.com/job/Studio...
Changes:
[Stephane] prepare 4.19.1.AM1 (#695)
------------------------------------------
[...truncated 3.35 MB...]
[INFO] Analyzed bundle 'org.jboss.tools.tests' with 37 classes
[INFO] Analyzed bundle 'org.jboss.tools.usage' with 73 classes
[INFO]
[INFO] --- tycho-p2-extras-plugin:2.2.0:compare-version-with-baselines (default) @
jacoco-report ---
[INFO]
[INFO] --- maven-install-plugin:2.4:install (default-install) @ jacoco-report ---
[INFO] Installing
<
https://studio-jenkins-csb-codeready.cloud.paas.psi.redhat.com/job/Studio...
to
<
https://studio-jenkins-csb-codeready.cloud.paas.psi.redhat.com/job/Studio...
[INFO] ------------------------------------------------------------------------
[INFO] Reactor Summary:
[INFO]
[INFO] jbosstools-base 4.5.0-SNAPSHOT ..................... SUCCESS [01:58 min]
[INFO] tests.all 3.7.103-SNAPSHOT ......................... SUCCESS [ 0.030 s]
[INFO] tests.plugins 3.7.103-SNAPSHOT ..................... SUCCESS [ 0.050 s]
[INFO] org.jboss.tools.tests 3.7.103-SNAPSHOT ............. SUCCESS [ 55.301 s]
[INFO] tests.tests 3.7.103-SNAPSHOT ....................... SUCCESS [ 0.026 s]
[INFO] org.jboss.tools.tests.test 3.7.103-SNAPSHOT ........ SUCCESS [ 1.437 s]
[INFO] tests.features 3.7.103-SNAPSHOT .................... SUCCESS [ 0.030 s]
[INFO] foundation.all 1.6.800-SNAPSHOT .................... SUCCESS [ 0.055 s]
[INFO] foundation.features 1.6.800-SNAPSHOT ............... SUCCESS [ 0.018 s]
[INFO] org.jboss.tools.foundation.license.feature 1.6.800-SNAPSHOT SUCCESS [ 0.372 s]
[INFO] org.jboss.tools.test.feature 3.7.103-SNAPSHOT ...... SUCCESS [ 0.728 s]
[INFO] foundation.plugins 1.6.800-SNAPSHOT ................ SUCCESS [ 0.026 s]
[INFO] org.jboss.tools.foundation.core 1.6.800-SNAPSHOT ... SUCCESS [ 11.714 s]
[INFO] org.jboss.tools.foundation.checkup 1.6.800-SNAPSHOT SUCCESS [ 2.009 s]
[INFO] org.jboss.tools.foundation.ui 1.6.800-SNAPSHOT ..... SUCCESS [ 9.927 s]
[INFO] org.jboss.tools.foundation.security.linux 1.6.800-SNAPSHOT SUCCESS [ 1.590 s]
[INFO] org.jboss.tools.foundation.help.ui 1.6.800-SNAPSHOT SUCCESS [ 1.839 s]
[INFO] org.jboss.tools.foundation.feature 1.6.800-SNAPSHOT SUCCESS [ 0.501 s]
[INFO] org.jboss.tools.foundation.security.linux.feature 1.6.800-SNAPSHOT SUCCESS [ 0.484
s]
[INFO] foundation.tests 1.6.800-SNAPSHOT .................. SUCCESS [ 0.048 s]
[INFO] org.jboss.tools.foundation.checkup.test 1.6.800-SNAPSHOT SUCCESS [ 1.595 s]
[INFO] org.jboss.tools.foundation.core.test 1.6.800-SNAPSHOT SUCCESS [ 1.811 s]
[INFO] org.jboss.tools.foundation.help.test 1.6.800-SNAPSHOT SUCCESS [ 1.286 s]
[INFO] org.jboss.tools.foundation.ui.test 1.6.800-SNAPSHOT SUCCESS [ 1.624 s]
[INFO] org.jboss.tools.foundation.test.feature 1.6.800-SNAPSHOT SUCCESS [ 0.562 s]
[INFO] common.all 3.16.0-SNAPSHOT ......................... SUCCESS [ 0.022 s]
[INFO] common.plugins 3.16.0-SNAPSHOT ..................... SUCCESS [ 0.017 s]
[INFO] org.jboss.tools.common.core 3.16.0-SNAPSHOT ........ SUCCESS [ 11.278 s]
[INFO] org.jboss.tools.common 3.16.0-SNAPSHOT ............. SUCCESS [ 10.533 s]
[INFO] org.jboss.tools.common.resref.core 3.16.0-SNAPSHOT . SUCCESS [ 3.448 s]
[INFO] org.jboss.tools.common.el.core 3.16.0-SNAPSHOT ..... SUCCESS [ 5.257 s]
[INFO] org.jboss.tools.common.model.ui.capabilities 3.16.0-SNAPSHOT SUCCESS [ 2.668 s]
[INFO] org.jboss.tools.common.model 3.16.0-SNAPSHOT ....... SUCCESS [ 13.052 s]
[INFO] org.jboss.tools.common.text.xml 3.16.0-SNAPSHOT .... SUCCESS [ 4.952 s]
[INFO] org.jboss.tools.common.validation 3.16.0-SNAPSHOT .. SUCCESS [ 5.071 s]
[INFO] org.jboss.tools.common.ui 3.16.0-SNAPSHOT .......... SUCCESS [ 5.694 s]
[INFO] org.jboss.tools.common.text.ext 3.16.0-SNAPSHOT .... SUCCESS [ 5.468 s]
[INFO] org.jboss.tools.common.model.ui 3.16.0-SNAPSHOT .... SUCCESS [ 15.448 s]
[INFO] org.jboss.tools.common.el.ui 3.16.0-SNAPSHOT ....... SUCCESS [ 4.477 s]
[INFO] org.jboss.tools.common.gef 3.16.0-SNAPSHOT ......... SUCCESS [ 4.593 s]
[INFO] org.jboss.tools.common.meta.ui 3.16.0-SNAPSHOT ..... SUCCESS [ 2.212 s]
[INFO] org.jboss.tools.common.projecttemplates 3.16.0-SNAPSHOT SUCCESS [ 32.758 s]
[INFO] org.jboss.tools.common.resref.ui 3.16.0-SNAPSHOT ... SUCCESS [ 4.632 s]
[INFO] org.jboss.tools.common.verification 3.16.0-SNAPSHOT SUCCESS [ 4.880 s]
[INFO] org.jboss.tools.common.verification.ui 3.16.0-SNAPSHOT SUCCESS [ 4.604 s]
[INFO] org.jboss.tools.common.jdt.debug 3.16.0-SNAPSHOT ... SUCCESS [ 6.171 s]
[INFO] org.jboss.tools.common.jdt.debug.ui 3.16.0-SNAPSHOT SUCCESS [ 3.927 s]
[INFO] org.jboss.tools.common.jdt 3.16.0-SNAPSHOT ......... SUCCESS [ 3.437 s]
[INFO] org.jboss.tools.common.jdt.ui 3.16.0-SNAPSHOT ...... SUCCESS [ 3.498 s]
[INFO] org.jboss.tools.common.mylyn 3.16.0-SNAPSHOT ....... SUCCESS [ 2.647 s]
[INFO] org.jboss.tools.common.jaxb 3.16.0-SNAPSHOT ........ SUCCESS [ 24.930 s]
[INFO] org.jboss.tools.common.oauth.core 3.16.0-SNAPSHOT .. SUCCESS [ 53.139 s]
[INFO] org.jboss.tools.common.oauth.ui 3.16.0-SNAPSHOT .... SUCCESS [ 3.461 s]
[INFO] common.features 3.16.0-SNAPSHOT .................... SUCCESS [ 0.018 s]
[INFO] org.jboss.tools.common.core.feature 3.16.0-SNAPSHOT SUCCESS [ 2.454 s]
[INFO] org.jboss.tools.common.feature 3.16.0-SNAPSHOT ..... SUCCESS [ 4.370 s]
[INFO] org.jboss.tools.common.text.ext.feature 3.16.0-SNAPSHOT SUCCESS [ 2.143 s]
[INFO] org.jboss.tools.common.ui.feature 3.16.0-SNAPSHOT .. SUCCESS [ 2.252 s]
[INFO] org.jboss.tools.common.verification.feature 3.16.0-SNAPSHOT SUCCESS [ 2.246 s]
[INFO] org.jboss.tools.common.oauth.feature 3.16.0-SNAPSHOT SUCCESS [ 1.265 s]
[INFO] org.jboss.tools.common.all.feature 3.16.0-SNAPSHOT . SUCCESS [ 0.525 s]
[INFO] common.test-framework 3.16.0-SNAPSHOT .............. SUCCESS [ 0.020 s]
[INFO] org.jboss.tools.common.reddeer 3.16.0-SNAPSHOT ..... SUCCESS [ 13.392 s]
[INFO] common.tests 3.16.0-SNAPSHOT ....................... SUCCESS [ 0.026 s]
[INFO] org.jboss.tools.common.core.test 3.16.0-SNAPSHOT ... SUCCESS [ 5.441 s]
[INFO] org.jboss.tools.common.test 3.16.0-SNAPSHOT ........ SUCCESS [ 2.139 s]
[INFO] org.jboss.tools.common.el.core.test 3.16.0-SNAPSHOT SUCCESS [ 2.837 s]
[INFO] org.jboss.tools.common.model.test 3.16.0-SNAPSHOT .. SUCCESS [ 2.394 s]
[INFO] org.jboss.tools.common.model.ui.test 3.16.0-SNAPSHOT SUCCESS [ 2.266 s]
[INFO] org.jboss.tools.common.base.test 3.16.0-SNAPSHOT ... SUCCESS [ 2.254 s]
[INFO] org.jboss.tools.common.validation.test 3.16.0-SNAPSHOT SUCCESS [ 1.790 s]
[INFO] org.jboss.tools.common.verification.test 3.16.0-SNAPSHOT SUCCESS [ 1.797 s]
[INFO] org.jboss.tools.common.verification.ui.test 3.16.0-SNAPSHOT SUCCESS [ 1.480 s]
[INFO] org.jboss.tools.common.ui.test 3.16.0-SNAPSHOT ..... SUCCESS [ 1.896 s]
[INFO] org.jboss.tools.common.text.ext.test 3.16.0-SNAPSHOT SUCCESS [ 1.572 s]
[INFO] org.jboss.tools.common.mylyn.test 3.8.100-SNAPSHOT . SUCCESS [ 1.006 s]
[INFO] org.jboss.tools.common.oauth.core.test 3.16.0-SNAPSHOT SUCCESS [ 1.327 s]
[INFO] org.jboss.tools.common.all.test.feature 3.8.200-SNAPSHOT SUCCESS [ 0.512 s]
[INFO] org.jboss.tools.common.jdt.feature 3.16.0-SNAPSHOT . SUCCESS [ 7.321 s]
[INFO] org.jboss.tools.common.mylyn.feature 3.16.0-SNAPSHOT SUCCESS [ 7.908 s]
[INFO] stacks.all 1.4.103-SNAPSHOT ........................ SUCCESS [ 0.018 s]
[INFO] stacks.plugins 1.4.103-SNAPSHOT .................... SUCCESS [ 0.015 s]
[INFO] org.jboss.tools.stacks.core 1.4.103-SNAPSHOT ....... SUCCESS [ 34.762 s]
[INFO] stacks.tests 1.4.103-SNAPSHOT ...................... SUCCESS [ 0.016 s]
[INFO] org.jboss.tools.stacks.core.test 1.4.103-SNAPSHOT .. SUCCESS [ 1.183 s]
[INFO] stacks.features 1.4.103-SNAPSHOT ................... SUCCESS [ 0.015 s]
[INFO] org.jboss.tools.stacks.core.feature 1.4.103-SNAPSHOT SUCCESS [ 2.105 s]
[INFO] org.jboss.tools.stacks.core.test.feature 1.4.103-SNAPSHOT SUCCESS [ 0.226 s]
[INFO] runtime.all 3.5.100-SNAPSHOT ....................... SUCCESS [ 0.015 s]
[INFO] runtime.plugins 3.5.100-SNAPSHOT ................... SUCCESS [ 0.015 s]
[INFO] org.jboss.tools.runtime.core 3.5.100-SNAPSHOT ...... SUCCESS [ 22.663 s]
[INFO] org.jboss.tools.runtime.ui 3.5.100-SNAPSHOT ........ SUCCESS [ 9.471 s]
[INFO] runtime.test-framework 3.5.100-SNAPSHOT ............ SUCCESS [ 0.017 s]
[INFO] org.jboss.tools.runtime.reddeer 3.5.100-SNAPSHOT ... SUCCESS [ 1.114 s]
[INFO] runtime.tests 3.5.100-SNAPSHOT ..................... SUCCESS [ 0.014 s]
[INFO] org.jboss.tools.runtime.test 3.5.100-SNAPSHOT ...... SUCCESS [ 1.620 s]
[INFO] runtime.features 3.5.100-SNAPSHOT .................. SUCCESS [ 0.053 s]
[INFO] org.jboss.tools.runtime.core.feature 3.5.100-SNAPSHOT SUCCESS [ 2.260 s]
[INFO] org.jboss.tools.runtime.test.feature 3.5.100-SNAPSHOT SUCCESS [ 0.225 s]
[INFO] usage.all 2.2.300-SNAPSHOT ......................... SUCCESS [ 0.016 s]
[INFO] usage.plugins 2.2.300-SNAPSHOT ..................... SUCCESS [ 0.015 s]
[INFO] org.jboss.tools.usage 2.2.300-SNAPSHOT ............. SUCCESS [ 4.242 s]
[INFO] usage.tests 2.2.300-SNAPSHOT ....................... SUCCESS [ 0.020 s]
[INFO] org.jboss.tools.usage.test 2.2.300-SNAPSHOT ........ SUCCESS [ 1.396 s]
[INFO] usage.features 2.2.300-SNAPSHOT .................... SUCCESS [ 0.020 s]
[INFO] org.jboss.tools.usage.feature 2.2.300-SNAPSHOT ..... SUCCESS [ 2.234 s]
[INFO] org.jboss.tools.usage.test.feature 2.2.300-SNAPSHOT SUCCESS [ 0.187 s]
[INFO] base.site 4.5.0-SNAPSHOT ........................... FAILURE [ 0.519 s]
[INFO] Base JaCoCo Report 4.5.0-SNAPSHOT .................. SUCCESS [ 4.938 s]
[INFO] ------------------------------------------------------------------------
[INFO] BUILD FAILURE
[INFO] ------------------------------------------------------------------------
[INFO] Total time: 17:02 min
[INFO] Finished at: 2021-04-29T09:58:37-04:00
[INFO] ------------------------------------------------------------------------
[ERROR] Failed to execute goal
org.eclipse.tycho:tycho-p2-repository-plugin:2.2.0:assemble-repository
(default-assemble-repository) on project base.site: Execution default-assemble-repository
of goal org.eclipse.tycho:tycho-p2-repository-plugin:2.2.0:assemble-repository failed:
Cannot resolve dependencies of MavenProject: org.jboss.tools.base:base.site:4.5.0-SNAPSHOT
@
<
https://studio-jenkins-csb-codeready.cloud.paas.psi.redhat.com/job/Studio...;:
See log for details -> [Help 1]
org.apache.maven.lifecycle.LifecycleExecutionException: Failed to execute goal
org.eclipse.tycho:tycho-p2-repository-plugin:2.2.0:assemble-repository
(default-assemble-repository) on project base.site: Execution default-assemble-repository
of goal org.eclipse.tycho:tycho-p2-repository-plugin:2.2.0:assemble-repository failed:
Cannot resolve dependencies of MavenProject: org.jboss.tools.base:base.site:4.5.0-SNAPSHOT
@
<
https://studio-jenkins-csb-codeready.cloud.paas.psi.redhat.com/job/Studio...
at org.apache.maven.lifecycle.internal.MojoExecutor.execute (MojoExecutor.java:215)
at org.apache.maven.lifecycle.internal.MojoExecutor.execute (MojoExecutor.java:156)
at org.apache.maven.lifecycle.internal.MojoExecutor.execute (MojoExecutor.java:148)
at org.apache.maven.lifecycle.internal.LifecycleModuleBuilder.buildProject
(LifecycleModuleBuilder.java:117)
at org.apache.maven.lifecycle.internal.LifecycleModuleBuilder.buildProject
(LifecycleModuleBuilder.java:81)
at
org.apache.maven.lifecycle.internal.builder.singlethreaded.SingleThreadedBuilder.build
(SingleThreadedBuilder.java:56)
at org.apache.maven.lifecycle.internal.LifecycleStarter.execute
(LifecycleStarter.java:128)
at org.apache.maven.DefaultMaven.doExecute (DefaultMaven.java:305)
at org.apache.maven.DefaultMaven.doExecute (DefaultMaven.java:192)
at org.apache.maven.DefaultMaven.execute (DefaultMaven.java:105)
at org.apache.maven.cli.MavenCli.execute (MavenCli.java:957)
at org.apache.maven.cli.MavenCli.doMain (MavenCli.java:289)
at org.apache.maven.cli.MavenCli.main (MavenCli.java:193)
at jdk.internal.reflect.NativeMethodAccessorImpl.invoke0 (Native Method)
at jdk.internal.reflect.NativeMethodAccessorImpl.invoke
(NativeMethodAccessorImpl.java:62)
at jdk.internal.reflect.DelegatingMethodAccessorImpl.invoke
(DelegatingMethodAccessorImpl.java:43)
at java.lang.reflect.Method.invoke (Method.java:566)
at org.codehaus.plexus.classworlds.launcher.Launcher.launchEnhanced
(Launcher.java:282)
at org.codehaus.plexus.classworlds.launcher.Launcher.launch (Launcher.java:225)
at org.codehaus.plexus.classworlds.launcher.Launcher.mainWithExitCode
(Launcher.java:406)
at org.codehaus.plexus.classworlds.launcher.Launcher.main (Launcher.java:347)
Caused by: org.apache.maven.plugin.PluginExecutionException: Execution
default-assemble-repository of goal
org.eclipse.tycho:tycho-p2-repository-plugin:2.2.0:assemble-repository failed: Cannot
resolve dependencies of MavenProject: org.jboss.tools.base:base.site:4.5.0-SNAPSHOT @
<
https://studio-jenkins-csb-codeready.cloud.paas.psi.redhat.com/job/Studio...
at org.apache.maven.plugin.DefaultBuildPluginManager.executeMojo
(DefaultBuildPluginManager.java:148)
at org.apache.maven.lifecycle.internal.MojoExecutor.execute (MojoExecutor.java:210)
at org.apache.maven.lifecycle.internal.MojoExecutor.execute (MojoExecutor.java:156)
at org.apache.maven.lifecycle.internal.MojoExecutor.execute (MojoExecutor.java:148)
at org.apache.maven.lifecycle.internal.LifecycleModuleBuilder.buildProject
(LifecycleModuleBuilder.java:117)
at org.apache.maven.lifecycle.internal.LifecycleModuleBuilder.buildProject
(LifecycleModuleBuilder.java:81)
at
org.apache.maven.lifecycle.internal.builder.singlethreaded.SingleThreadedBuilder.build
(SingleThreadedBuilder.java:56)
at org.apache.maven.lifecycle.internal.LifecycleStarter.execute
(LifecycleStarter.java:128)
at org.apache.maven.DefaultMaven.doExecute (DefaultMaven.java:305)
at org.apache.maven.DefaultMaven.doExecute (DefaultMaven.java:192)
at org.apache.maven.DefaultMaven.execute (DefaultMaven.java:105)
at org.apache.maven.cli.MavenCli.execute (MavenCli.java:957)
at org.apache.maven.cli.MavenCli.doMain (MavenCli.java:289)
at org.apache.maven.cli.MavenCli.main (MavenCli.java:193)
at jdk.internal.reflect.NativeMethodAccessorImpl.invoke0 (Native Method)
at jdk.internal.reflect.NativeMethodAccessorImpl.invoke
(NativeMethodAccessorImpl.java:62)
at jdk.internal.reflect.DelegatingMethodAccessorImpl.invoke
(DelegatingMethodAccessorImpl.java:43)
at java.lang.reflect.Method.invoke (Method.java:566)
at org.codehaus.plexus.classworlds.launcher.Launcher.launchEnhanced
(Launcher.java:282)
at org.codehaus.plexus.classworlds.launcher.Launcher.launch (Launcher.java:225)
at org.codehaus.plexus.classworlds.launcher.Launcher.mainWithExitCode
(Launcher.java:406)
at org.codehaus.plexus.classworlds.launcher.Launcher.main (Launcher.java:347)
Caused by: org.eclipse.tycho.artifacts.DependencyResolutionException: Cannot resolve
dependencies of MavenProject: org.jboss.tools.base:base.site:4.5.0-SNAPSHOT @
<
https://studio-jenkins-csb-codeready.cloud.paas.psi.redhat.com/job/Studio...
at org.eclipse.tycho.p2.resolver.P2ResolverImpl.resolveDependencies
(P2ResolverImpl.java:249)
at org.eclipse.tycho.p2.resolver.P2ResolverImpl.resolveTargetDependencies
(P2ResolverImpl.java:129)
at org.eclipse.tycho.p2.resolver.P2DependencyResolver.doResolveDependencies
(P2DependencyResolver.java:363)
at org.eclipse.tycho.p2.resolver.P2DependencyResolver.resolveDependencies
(P2DependencyResolver.java:331)
at org.eclipse.tycho.p2.facade.RepositoryReferenceTool.addTargetPlatformRepository
(RepositoryReferenceTool.java:128)
at org.eclipse.tycho.p2.facade.RepositoryReferenceTool.getVisibleRepositories
(RepositoryReferenceTool.java:98)
at
org.eclipse.tycho.plugins.p2.repository.AssembleRepositoryMojo.getVisibleRepositories
(AssembleRepositoryMojo.java:193)
at org.eclipse.tycho.plugins.p2.repository.AssembleRepositoryMojo.execute
(AssembleRepositoryMojo.java:155)
at org.apache.maven.plugin.DefaultBuildPluginManager.executeMojo
(DefaultBuildPluginManager.java:137)
at org.apache.maven.lifecycle.internal.MojoExecutor.execute (MojoExecutor.java:210)
at org.apache.maven.lifecycle.internal.MojoExecutor.execute (MojoExecutor.java:156)
at org.apache.maven.lifecycle.internal.MojoExecutor.execute (MojoExecutor.java:148)
at org.apache.maven.lifecycle.internal.LifecycleModuleBuilder.buildProject
(LifecycleModuleBuilder.java:117)
at org.apache.maven.lifecycle.internal.LifecycleModuleBuilder.buildProject
(LifecycleModuleBuilder.java:81)
at
org.apache.maven.lifecycle.internal.builder.singlethreaded.SingleThreadedBuilder.build
(SingleThreadedBuilder.java:56)
at org.apache.maven.lifecycle.internal.LifecycleStarter.execute
(LifecycleStarter.java:128)
at org.apache.maven.DefaultMaven.doExecute (DefaultMaven.java:305)
at org.apache.maven.DefaultMaven.doExecute (DefaultMaven.java:192)
at org.apache.maven.DefaultMaven.execute (DefaultMaven.java:105)
at org.apache.maven.cli.MavenCli.execute (MavenCli.java:957)
at org.apache.maven.cli.MavenCli.doMain (MavenCli.java:289)
at org.apache.maven.cli.MavenCli.main (MavenCli.java:193)
at jdk.internal.reflect.NativeMethodAccessorImpl.invoke0 (Native Method)
at jdk.internal.reflect.NativeMethodAccessorImpl.invoke
(NativeMethodAccessorImpl.java:62)
at jdk.internal.reflect.DelegatingMethodAccessorImpl.invoke
(DelegatingMethodAccessorImpl.java:43)
at java.lang.reflect.Method.invoke (Method.java:566)
at org.codehaus.plexus.classworlds.launcher.Launcher.launchEnhanced
(Launcher.java:282)
at org.codehaus.plexus.classworlds.launcher.Launcher.launch (Launcher.java:225)
at org.codehaus.plexus.classworlds.launcher.Launcher.mainWithExitCode
(Launcher.java:406)
at org.codehaus.plexus.classworlds.launcher.Launcher.main (Launcher.java:347)
Caused by: org.eclipse.tycho.p2.util.resolution.ResolverException: See log for details
at org.eclipse.tycho.p2.util.resolution.ProjectorResolutionStrategy.resolve
(ProjectorResolutionStrategy.java:90)
at org.eclipse.tycho.p2.util.resolution.AbstractResolutionStrategy.resolve
(AbstractResolutionStrategy.java:44)
at org.eclipse.tycho.p2.resolver.P2ResolverImpl.resolveDependencies
(P2ResolverImpl.java:242)
at org.eclipse.tycho.p2.resolver.P2ResolverImpl.resolveTargetDependencies
(P2ResolverImpl.java:129)
at org.eclipse.tycho.p2.resolver.P2DependencyResolver.doResolveDependencies
(P2DependencyResolver.java:363)
at org.eclipse.tycho.p2.resolver.P2DependencyResolver.resolveDependencies
(P2DependencyResolver.java:331)
at org.eclipse.tycho.p2.facade.RepositoryReferenceTool.addTargetPlatformRepository
(RepositoryReferenceTool.java:128)
at org.eclipse.tycho.p2.facade.RepositoryReferenceTool.getVisibleRepositories
(RepositoryReferenceTool.java:98)
at
org.eclipse.tycho.plugins.p2.repository.AssembleRepositoryMojo.getVisibleRepositories
(AssembleRepositoryMojo.java:193)
at org.eclipse.tycho.plugins.p2.repository.AssembleRepositoryMojo.execute
(AssembleRepositoryMojo.java:155)
at org.apache.maven.plugin.DefaultBuildPluginManager.executeMojo
(DefaultBuildPluginManager.java:137)
at org.apache.maven.lifecycle.internal.MojoExecutor.execute (MojoExecutor.java:210)
at org.apache.maven.lifecycle.internal.MojoExecutor.execute (MojoExecutor.java:156)
at org.apache.maven.lifecycle.internal.MojoExecutor.execute (MojoExecutor.java:148)
at org.apache.maven.lifecycle.internal.LifecycleModuleBuilder.buildProject
(LifecycleModuleBuilder.java:117)
at org.apache.maven.lifecycle.internal.LifecycleModuleBuilder.buildProject
(LifecycleModuleBuilder.java:81)
at
org.apache.maven.lifecycle.internal.builder.singlethreaded.SingleThreadedBuilder.build
(SingleThreadedBuilder.java:56)
at org.apache.maven.lifecycle.internal.LifecycleStarter.execute
(LifecycleStarter.java:128)
at org.apache.maven.DefaultMaven.doExecute (DefaultMaven.java:305)
at org.apache.maven.DefaultMaven.doExecute (DefaultMaven.java:192)
at org.apache.maven.DefaultMaven.execute (DefaultMaven.java:105)
at org.apache.maven.cli.MavenCli.execute (MavenCli.java:957)
at org.apache.maven.cli.MavenCli.doMain (MavenCli.java:289)
at org.apache.maven.cli.MavenCli.main (MavenCli.java:193)
at jdk.internal.reflect.NativeMethodAccessorImpl.invoke0 (Native Method)
at jdk.internal.reflect.NativeMethodAccessorImpl.invoke
(NativeMethodAccessorImpl.java:62)
at jdk.internal.reflect.DelegatingMethodAccessorImpl.invoke
(DelegatingMethodAccessorImpl.java:43)
at java.lang.reflect.Method.invoke (Method.java:566)
at org.codehaus.plexus.classworlds.launcher.Launcher.launchEnhanced
(Launcher.java:282)
at org.codehaus.plexus.classworlds.launcher.Launcher.launch (Launcher.java:225)
at org.codehaus.plexus.classworlds.launcher.Launcher.mainWithExitCode
(Launcher.java:406)
at org.codehaus.plexus.classworlds.launcher.Launcher.main (Launcher.java:347)
[ERROR]
[ERROR] Re-run Maven using the -X switch to enable full debug logging.
[ERROR]
[ERROR] For more information about the errors and possible solutions, please read the
following articles:
[ERROR] [Help 1]
http://cwiki.apache.org/confluence/display/MAVEN/PluginExecutionException
[ERROR]
[ERROR] After correcting the problems, you can resume the build with the command
[ERROR] mvn <args> -rf :base.site
Build step 'Invoke top-level Maven targets' marked build as failure
Terminating xvnc.
Archiving artifacts
Recording test results
ERROR: Step ‘Publish JUnit test result report’ failed: No test report files were found.
Configuration error?
[description-setter] Description set: