See
<
http://jenkins.mw.lab.eng.bos.redhat.com/hudson/job/reddeer_master/868/ch...
Changes:
[rhopp] activateFacet method now accepts varags string for path to facet to
------------------------------------------
[...truncated 3096 lines...]
at org.junit.runners.Suite.runChild(Suite.java:128)
at org.junit.runners.Suite.runChild(Suite.java:27)
at org.junit.runners.ParentRunner$3.run(ParentRunner.java:290)
at org.junit.runners.ParentRunner$1.schedule(ParentRunner.java:71)
at org.junit.runners.ParentRunner.runChildren(ParentRunner.java:288)
at org.junit.runners.ParentRunner.access$000(ParentRunner.java:58)
at org.junit.runners.ParentRunner$2.evaluate(ParentRunner.java:268)
at org.junit.runners.ParentRunner.run(ParentRunner.java:363)
at org.apache.maven.surefire.junit4.JUnit4TestSet.execute(JUnit4TestSet.java:53)
at
org.apache.maven.surefire.junit4.JUnit4Provider.executeTestSet(JUnit4Provider.java:123)
at org.apache.maven.surefire.junit4.JUnit4Provider.invoke(JUnit4Provider.java:104)
at sun.reflect.NativeMethodAccessorImpl.invoke0(Native Method)
at sun.reflect.NativeMethodAccessorImpl.invoke(NativeMethodAccessorImpl.java:62)
at sun.reflect.DelegatingMethodAccessorImpl.invoke(DelegatingMethodAccessorImpl.java:43)
at java.lang.reflect.Method.invoke(Method.java:498)
at
org.apache.maven.surefire.util.ReflectionUtils.invokeMethodWithArray(ReflectionUtils.java:164)
at
org.apache.maven.surefire.booter.ProviderFactory$ProviderProxy.invoke(ProviderFactory.java:110)
at
org.apache.maven.surefire.booter.SurefireStarter.invokeProvider(SurefireStarter.java:175)
at
org.apache.maven.surefire.booter.SurefireStarter.runSuitesInProcess(SurefireStarter.java:123)
at
org.eclipse.tycho.surefire.osgibooter.OsgiSurefireBooter.run(OsgiSurefireBooter.java:87)
at
org.eclipse.tycho.surefire.osgibooter.AbstractUITestApplication.runTests(AbstractUITestApplication.java:44)
at org.eclipse.e4.ui.internal.workbench.swt.E4Testable$1.run(E4Testable.java:73)
at java.lang.Thread.run(Thread.java:745)
12:27:20.298 DEBUG [main][ScreenshotCapturer] Capturing Screenshot:
./target/screenshots/default/foo.bar.myplugin.mars.BasicTest(a)BeforeClassExt_CloseWelcomeScreenExt.png
12:27:20.446 DEBUG [main][ScreenshotCapturer] Screenshot successfully captured. Saved in
<
http://jenkins.mw.lab.eng.bos.redhat.com/hudson/job/reddeer_master/ws/sou...
12:27:20.447 DEBUG [WorkbenchTestable][RunIAfterClassExtensions] Run after class
extensions for test class foo.bar.myplugin.mars.BasicTest
12:27:20.448 DEBUG [WorkbenchTestable][RunIAfterClassExtensions] Run method
runAfterTestClass() of class
org.jboss.reddeer.junit.extension.after.test.impl.CloseAllShellsExt
12:27:20.449 ERROR [WorkbenchTestable][RunIAfterClassExtensions] Run method
runAfterTestClass() of class
org.jboss.reddeer.junit.extension.after.test.impl.CloseAllShellsExt failed
java.lang.NoSuchMethodError:
org.jboss.reddeer.core.handler.ShellHandler.closeAllNonWorbenchShells(Lorg/jboss/reddeer/core/handler/IBeforeShellIsClosed;)V
at
org.jboss.reddeer.junit.extension.after.test.impl.CloseAllShellsExt.run(CloseAllShellsExt.java:77)
at
org.jboss.reddeer.junit.extension.after.test.impl.CloseAllShellsExt.runAfterTestClass(CloseAllShellsExt.java:59)
at
org.jboss.reddeer.junit.internal.runner.statement.RunIAfterClassExtensions.evaluate(RunIAfterClassExtensions.java:73)
at org.junit.runners.ParentRunner.run(ParentRunner.java:363)
at
org.jboss.reddeer.junit.internal.runner.RequirementsRunner.run(RequirementsRunner.java:153)
at org.junit.runners.Suite.runChild(Suite.java:128)
at org.junit.runners.Suite.runChild(Suite.java:27)
at org.junit.runners.ParentRunner$3.run(ParentRunner.java:290)
at org.junit.runners.ParentRunner$1.schedule(ParentRunner.java:71)
at org.junit.runners.ParentRunner.runChildren(ParentRunner.java:288)
at org.junit.runners.ParentRunner.access$000(ParentRunner.java:58)
at org.junit.runners.ParentRunner$2.evaluate(ParentRunner.java:268)
at org.junit.runners.ParentRunner.run(ParentRunner.java:363)
at org.junit.runners.Suite.runChild(Suite.java:128)
at org.junit.runners.Suite.runChild(Suite.java:27)
at org.junit.runners.ParentRunner$3.run(ParentRunner.java:290)
at org.junit.runners.ParentRunner$1.schedule(ParentRunner.java:71)
at org.junit.runners.ParentRunner.runChildren(ParentRunner.java:288)
at org.junit.runners.ParentRunner.access$000(ParentRunner.java:58)
at org.junit.runners.ParentRunner$2.evaluate(ParentRunner.java:268)
at org.junit.runners.ParentRunner.run(ParentRunner.java:363)
at org.apache.maven.surefire.junit4.JUnit4TestSet.execute(JUnit4TestSet.java:53)
at
org.apache.maven.surefire.junit4.JUnit4Provider.executeTestSet(JUnit4Provider.java:123)
at org.apache.maven.surefire.junit4.JUnit4Provider.invoke(JUnit4Provider.java:104)
at sun.reflect.NativeMethodAccessorImpl.invoke0(Native Method)
at sun.reflect.NativeMethodAccessorImpl.invoke(NativeMethodAccessorImpl.java:62)
at sun.reflect.DelegatingMethodAccessorImpl.invoke(DelegatingMethodAccessorImpl.java:43)
at java.lang.reflect.Method.invoke(Method.java:498)
at
org.apache.maven.surefire.util.ReflectionUtils.invokeMethodWithArray(ReflectionUtils.java:164)
at
org.apache.maven.surefire.booter.ProviderFactory$ProviderProxy.invoke(ProviderFactory.java:110)
at
org.apache.maven.surefire.booter.SurefireStarter.invokeProvider(SurefireStarter.java:175)
at
org.apache.maven.surefire.booter.SurefireStarter.runSuitesInProcess(SurefireStarter.java:123)
at
org.eclipse.tycho.surefire.osgibooter.OsgiSurefireBooter.run(OsgiSurefireBooter.java:87)
at
org.eclipse.tycho.surefire.osgibooter.AbstractUITestApplication.runTests(AbstractUITestApplication.java:44)
at org.eclipse.e4.ui.internal.workbench.swt.E4Testable$1.run(E4Testable.java:73)
at java.lang.Thread.run(Thread.java:745)
12:27:20.575 DEBUG [main][ScreenshotCapturer] Capturing Screenshot:
./target/screenshots/default/foo.bar.myplugin.mars.BasicTest(a)AfterClassExt_CloseAllShellsExt.png
12:27:20.682 DEBUG [main][ScreenshotCapturer] Screenshot successfully captured. Saved in
<
http://jenkins.mw.lab.eng.bos.redhat.com/hudson/job/reddeer_master/ws/sou...
12:27:20.690 ERROR [WorkbenchTestable][RequirementsRunner] Exception in test:
foo.bar.myplugin.mars.BasicTest default
java.lang.NoClassDefFoundError: org/jboss/reddeer/core/lookup/WorkbenchPartLookup
at
org.jboss.reddeer.junit.extension.before.test.impl.CloseWelcomeScreenExt.closeWelcomeScreen(CloseWelcomeScreenExt.java:55)
at
org.jboss.reddeer.junit.extension.before.test.impl.CloseWelcomeScreenExt.runBeforeTestClass(CloseWelcomeScreenExt.java:40)
at
org.jboss.reddeer.junit.internal.runner.statement.RunIBeforeClassExtensions.evaluate(RunIBeforeClassExtensions.java:63)
at
org.jboss.reddeer.junit.internal.runner.statement.RunAfters.evaluate(RunAfters.java:68)
at
org.jboss.reddeer.junit.internal.runner.statement.CleanUpRequirementStatement.evaluate(CleanUpRequirementStatement.java:44)
at
org.jboss.reddeer.junit.internal.runner.statement.RunIAfterClassExtensions.evaluate(RunIAfterClassExtensions.java:59)
at org.junit.runners.ParentRunner.run(ParentRunner.java:363)
at
org.jboss.reddeer.junit.internal.runner.RequirementsRunner.run(RequirementsRunner.java:153)
at org.junit.runners.Suite.runChild(Suite.java:128)
at org.junit.runners.Suite.runChild(Suite.java:27)
at org.junit.runners.ParentRunner$3.run(ParentRunner.java:290)
at org.junit.runners.ParentRunner$1.schedule(ParentRunner.java:71)
at org.junit.runners.ParentRunner.runChildren(ParentRunner.java:288)
at org.junit.runners.ParentRunner.access$000(ParentRunner.java:58)
at org.junit.runners.ParentRunner$2.evaluate(ParentRunner.java:268)
at org.junit.runners.ParentRunner.run(ParentRunner.java:363)
at org.junit.runners.Suite.runChild(Suite.java:128)
at org.junit.runners.Suite.runChild(Suite.java:27)
at org.junit.runners.ParentRunner$3.run(ParentRunner.java:290)
at org.junit.runners.ParentRunner$1.schedule(ParentRunner.java:71)
at org.junit.runners.ParentRunner.runChildren(ParentRunner.java:288)
at org.junit.runners.ParentRunner.access$000(ParentRunner.java:58)
at org.junit.runners.ParentRunner$2.evaluate(ParentRunner.java:268)
at org.junit.runners.ParentRunner.run(ParentRunner.java:363)
at org.apache.maven.surefire.junit4.JUnit4TestSet.execute(JUnit4TestSet.java:53)
at
org.apache.maven.surefire.junit4.JUnit4Provider.executeTestSet(JUnit4Provider.java:123)
at org.apache.maven.surefire.junit4.JUnit4Provider.invoke(JUnit4Provider.java:104)
at sun.reflect.NativeMethodAccessorImpl.invoke0(Native Method)
at sun.reflect.NativeMethodAccessorImpl.invoke(NativeMethodAccessorImpl.java:62)
at sun.reflect.DelegatingMethodAccessorImpl.invoke(DelegatingMethodAccessorImpl.java:43)
at java.lang.reflect.Method.invoke(Method.java:498)
at
org.apache.maven.surefire.util.ReflectionUtils.invokeMethodWithArray(ReflectionUtils.java:164)
at
org.apache.maven.surefire.booter.ProviderFactory$ProviderProxy.invoke(ProviderFactory.java:110)
at
org.apache.maven.surefire.booter.SurefireStarter.invokeProvider(SurefireStarter.java:175)
at
org.apache.maven.surefire.booter.SurefireStarter.runSuitesInProcess(SurefireStarter.java:123)
at
org.eclipse.tycho.surefire.osgibooter.OsgiSurefireBooter.run(OsgiSurefireBooter.java:87)
at
org.eclipse.tycho.surefire.osgibooter.AbstractUITestApplication.runTests(AbstractUITestApplication.java:44)
at org.eclipse.e4.ui.internal.workbench.swt.E4Testable$1.run(E4Testable.java:73)
at java.lang.Thread.run(Thread.java:745)
Caused by: java.lang.ClassNotFoundException:
org.jboss.reddeer.core.lookup.WorkbenchPartLookup cannot be found by
org.jboss.reddeer.junit.extension_2.0.0.201612141122
at
org.eclipse.osgi.internal.loader.BundleLoader.findClassInternal(BundleLoader.java:439)
at org.eclipse.osgi.internal.loader.BundleLoader.findClass(BundleLoader.java:352)
at org.eclipse.osgi.internal.loader.BundleLoader.findClass(BundleLoader.java:344)
at
org.eclipse.osgi.internal.loader.ModuleClassLoader.loadClass(ModuleClassLoader.java:160)
at java.lang.ClassLoader.loadClass(ClassLoader.java:357)
... 39 more
java.lang.ClassNotFoundException: org.jboss.reddeer.core.lookup.WorkbenchPartLookup cannot
be found by org.jboss.reddeer.junit.extension_2.0.0.201612141122
at
org.eclipse.osgi.internal.loader.BundleLoader.findClassInternal(BundleLoader.java:439)
at org.eclipse.osgi.internal.loader.BundleLoader.findClass(BundleLoader.java:352)
at org.eclipse.osgi.internal.loader.BundleLoader.findClass(BundleLoader.java:344)
at
org.eclipse.osgi.internal.loader.ModuleClassLoader.loadClass(ModuleClassLoader.java:160)
at java.lang.ClassLoader.loadClass(ClassLoader.java:357)
at
org.jboss.reddeer.junit.extension.before.test.impl.CloseWelcomeScreenExt.closeWelcomeScreen(CloseWelcomeScreenExt.java:55)
at
org.jboss.reddeer.junit.extension.before.test.impl.CloseWelcomeScreenExt.runBeforeTestClass(CloseWelcomeScreenExt.java:40)
at
org.jboss.reddeer.junit.internal.runner.statement.RunIBeforeClassExtensions.evaluate(RunIBeforeClassExtensions.java:63)
at
org.jboss.reddeer.junit.internal.runner.statement.RunAfters.evaluate(RunAfters.java:68)
at
org.jboss.reddeer.junit.internal.runner.statement.CleanUpRequirementStatement.evaluate(CleanUpRequirementStatement.java:44)
at
org.jboss.reddeer.junit.internal.runner.statement.RunIAfterClassExtensions.evaluate(RunIAfterClassExtensions.java:59)
at org.junit.runners.ParentRunner.run(ParentRunner.java:363)
at
org.jboss.reddeer.junit.internal.runner.RequirementsRunner.run(RequirementsRunner.java:153)
at org.junit.runners.Suite.runChild(Suite.java:128)
at org.junit.runners.Suite.runChild(Suite.java:27)
at org.junit.runners.ParentRunner$3.run(ParentRunner.java:290)
at org.junit.runners.ParentRunner$1.schedule(ParentRunner.java:71)
at org.junit.runners.ParentRunner.runChildren(ParentRunner.java:288)
at org.junit.runners.ParentRunner.access$000(ParentRunner.java:58)
at org.junit.runners.ParentRunner$2.evaluate(ParentRunner.java:268)
at org.junit.runners.ParentRunner.run(ParentRunner.java:363)
at org.junit.runners.Suite.runChild(Suite.java:128)
at org.junit.runners.Suite.runChild(Suite.java:27)
at org.junit.runners.ParentRunner$3.run(ParentRunner.java:290)
at org.junit.runners.ParentRunner$1.schedule(ParentRunner.java:71)
at org.junit.runners.ParentRunner.runChildren(ParentRunner.java:288)
at org.junit.runners.ParentRunner.access$000(ParentRunner.java:58)
at org.junit.runners.ParentRunner$2.evaluate(ParentRunner.java:268)
at org.junit.runners.ParentRunner.run(ParentRunner.java:363)
at org.apache.maven.surefire.junit4.JUnit4TestSet.execute(JUnit4TestSet.java:53)
at
org.apache.maven.surefire.junit4.JUnit4Provider.executeTestSet(JUnit4Provider.java:123)
at org.apache.maven.surefire.junit4.JUnit4Provider.invoke(JUnit4Provider.java:104)
at sun.reflect.NativeMethodAccessorImpl.invoke0(Native Method)
at sun.reflect.NativeMethodAccessorImpl.invoke(NativeMethodAccessorImpl.java:62)
at sun.reflect.DelegatingMethodAccessorImpl.invoke(DelegatingMethodAccessorImpl.java:43)
at java.lang.reflect.Method.invoke(Method.java:498)
at
org.apache.maven.surefire.util.ReflectionUtils.invokeMethodWithArray(ReflectionUtils.java:164)
at
org.apache.maven.surefire.booter.ProviderFactory$ProviderProxy.invoke(ProviderFactory.java:110)
at
org.apache.maven.surefire.booter.SurefireStarter.invokeProvider(SurefireStarter.java:175)
at
org.apache.maven.surefire.booter.SurefireStarter.runSuitesInProcess(SurefireStarter.java:123)
at
org.eclipse.tycho.surefire.osgibooter.OsgiSurefireBooter.run(OsgiSurefireBooter.java:87)
at
org.eclipse.tycho.surefire.osgibooter.AbstractUITestApplication.runTests(AbstractUITestApplication.java:44)
at org.eclipse.e4.ui.internal.workbench.swt.E4Testable$1.run(E4Testable.java:73)
at java.lang.Thread.run(Thread.java:745)
12:27:20.695 ERROR [WorkbenchTestable][RequirementsRunner] Exception in test:
foo.bar.myplugin.mars.BasicTest default
java.lang.NoSuchMethodError:
org.jboss.reddeer.core.handler.ShellHandler.closeAllNonWorbenchShells(Lorg/jboss/reddeer/core/handler/IBeforeShellIsClosed;)V
at
org.jboss.reddeer.junit.extension.after.test.impl.CloseAllShellsExt.run(CloseAllShellsExt.java:77)
at
org.jboss.reddeer.junit.extension.after.test.impl.CloseAllShellsExt.runAfterTestClass(CloseAllShellsExt.java:59)
at
org.jboss.reddeer.junit.internal.runner.statement.RunIAfterClassExtensions.evaluate(RunIAfterClassExtensions.java:73)
at org.junit.runners.ParentRunner.run(ParentRunner.java:363)
at
org.jboss.reddeer.junit.internal.runner.RequirementsRunner.run(RequirementsRunner.java:153)
at org.junit.runners.Suite.runChild(Suite.java:128)
at org.junit.runners.Suite.runChild(Suite.java:27)
at org.junit.runners.ParentRunner$3.run(ParentRunner.java:290)
at org.junit.runners.ParentRunner$1.schedule(ParentRunner.java:71)
at org.junit.runners.ParentRunner.runChildren(ParentRunner.java:288)
at org.junit.runners.ParentRunner.access$000(ParentRunner.java:58)
at org.junit.runners.ParentRunner$2.evaluate(ParentRunner.java:268)
at org.junit.runners.ParentRunner.run(ParentRunner.java:363)
at org.junit.runners.Suite.runChild(Suite.java:128)
at org.junit.runners.Suite.runChild(Suite.java:27)
at org.junit.runners.ParentRunner$3.run(ParentRunner.java:290)
at org.junit.runners.ParentRunner$1.schedule(ParentRunner.java:71)
at org.junit.runners.ParentRunner.runChildren(ParentRunner.java:288)
at org.junit.runners.ParentRunner.access$000(ParentRunner.java:58)
at org.junit.runners.ParentRunner$2.evaluate(ParentRunner.java:268)
at org.junit.runners.ParentRunner.run(ParentRunner.java:363)
at org.apache.maven.surefire.junit4.JUnit4TestSet.execute(JUnit4TestSet.java:53)
at
org.apache.maven.surefire.junit4.JUnit4Provider.executeTestSet(JUnit4Provider.java:123)
at org.apache.maven.surefire.junit4.JUnit4Provider.invoke(JUnit4Provider.java:104)
at sun.reflect.NativeMethodAccessorImpl.invoke0(Native Method)
at sun.reflect.NativeMethodAccessorImpl.invoke(NativeMethodAccessorImpl.java:62)
at sun.reflect.DelegatingMethodAccessorImpl.invoke(DelegatingMethodAccessorImpl.java:43)
at java.lang.reflect.Method.invoke(Method.java:498)
at
org.apache.maven.surefire.util.ReflectionUtils.invokeMethodWithArray(ReflectionUtils.java:164)
at
org.apache.maven.surefire.booter.ProviderFactory$ProviderProxy.invoke(ProviderFactory.java:110)
at
org.apache.maven.surefire.booter.SurefireStarter.invokeProvider(SurefireStarter.java:175)
at
org.apache.maven.surefire.booter.SurefireStarter.runSuitesInProcess(SurefireStarter.java:123)
at
org.eclipse.tycho.surefire.osgibooter.OsgiSurefireBooter.run(OsgiSurefireBooter.java:87)
at
org.eclipse.tycho.surefire.osgibooter.AbstractUITestApplication.runTests(AbstractUITestApplication.java:44)
at org.eclipse.e4.ui.internal.workbench.swt.E4Testable$1.run(E4Testable.java:73)
at java.lang.Thread.run(Thread.java:745)
Tests run: 2, Failures: 0, Errors: 2, Skipped: 0, Time elapsed: 2.915 sec <<<
FAILURE!
Results :
Tests in error:
foo.bar.myplugin.mars.BasicTest default:
org/jboss/reddeer/core/lookup/WorkbenchPartLookup
foo.bar.myplugin.mars.BasicTest default:
org.jboss.reddeer.core.handler.ShellHandler.closeAllNonWorbenchShells(Lorg/jboss/reddeer/core/handler/IBeforeShellIsClosed;)V
Tests run: 2, Failures: 0, Errors: 2, Skipped: 0
[INFO] ------------------------------------------------------------------------
[INFO] BUILD FAILURE
[INFO] ------------------------------------------------------------------------
[INFO] Total time: 03:55 min
[INFO] Finished at: 2016-12-20T12:27:22-05:00
[INFO] Final Memory: 118M/655M
[INFO] ------------------------------------------------------------------------
[ERROR] Failed to execute goal org.eclipse.tycho:tycho-surefire-plugin:0.21.0:test
(default-test) on project mars: There are test failures.
[ERROR]
[ERROR] Please refer to
<
http://jenkins.mw.lab.eng.bos.redhat.com/hudson/job/reddeer_master/ws/sou...
for the individual test results.
[ERROR] -> [Help 1]
[ERROR]
[ERROR] To see the full stack trace of the errors, re-run Maven with the -e switch.
[ERROR] Re-run Maven using the -X switch to enable full debug logging.
[ERROR]
[ERROR] For more information about the errors and possible solutions, please read the
following articles:
[ERROR] [Help 1]
http://cwiki.apache.org/confluence/display/MAVEN/MojoFailureException
[INFO] Post-archetype-generation invoker exit code: 1
[INFO] ------------------------------------------------------------------------
[INFO] BUILD FAILURE
[INFO] ------------------------------------------------------------------------
[INFO] Total time: 03:58 min
[INFO] Finished at: 2016-12-20T12:27:23-05:00
[INFO] Final Memory: 14M/491M
[INFO] ------------------------------------------------------------------------
[ERROR] Failed to execute goal
org.apache.maven.plugins:maven-archetype-plugin:2.1:integration-test
(default-integration-test) on project jboss-reddeer-archetype:
[ERROR] Archetype IT 'jboss-reddeer-archetype' failed: Execution failure: exit
code = 1
[ERROR] -> [Help 1]
[ERROR]
[ERROR] To see the full stack trace of the errors, re-run Maven with the -e switch.
[ERROR] Re-run Maven using the -X switch to enable full debug logging.
[ERROR]
[ERROR] For more information about the errors and possible solutions, please read the
following articles:
[ERROR] [Help 1]
http://cwiki.apache.org/confluence/display/MAVEN/MojoExecutionException
Build step 'Invoke top-level Maven targets' marked build as failure
Terminating xvnc.
$ vncserver -kill :37
Killing Xvnc process ID 3758
Checking console output
Archiving artifacts
[description-setter] Description set: