See
<
http://jenkins.mw.lab.eng.bos.redhat.com/hudson/job/jbosstools-javaee_4.3...
------------------------------------------
[...truncated 18484 lines...]
[INFO]
[INFO] --- maven-resources-plugin:2.4.1:resources (default-resources) @
org.jboss.tools.seam.vpe.test ---
[INFO] Using 'ISO-8859-1' encoding to copy filtered resources.
[INFO] skip non existing resourceDirectory
<
http://jenkins.mw.lab.eng.bos.redhat.com/hudson/job/jbosstools-javaee_4.3...
[INFO]
[INFO] --- tycho-compiler-plugin:0.23.1:compile (default-compile) @
org.jboss.tools.seam.vpe.test ---
[INFO] Nothing to compile - all classes are up to date
[INFO]
[INFO] --- maven-resources-plugin:2.4.1:testResources (default-testResources) @
org.jboss.tools.seam.vpe.test ---
[INFO] Using 'ISO-8859-1' encoding to copy filtered resources.
[INFO] skip non existing resourceDirectory
<
http://jenkins.mw.lab.eng.bos.redhat.com/hudson/job/jbosstools-javaee_4.3...
[INFO]
[INFO] --- tycho-source-plugin:0.23.1:plugin-source (plugin-source) @
org.jboss.tools.seam.vpe.test ---
[INFO] Building jar:
<
http://jenkins.mw.lab.eng.bos.redhat.com/hudson/job/jbosstools-javaee_4.3...
[INFO]
[INFO] --- target-platform-configuration:0.23.1:target-platform (default-target-platform)
@ org.jboss.tools.seam.vpe.test ---
[INFO]
[INFO] --- tycho-packaging-plugin:0.23.1:package-plugin (default-package-plugin) @
org.jboss.tools.seam.vpe.test ---
[INFO] Building jar:
<
http://jenkins.mw.lab.eng.bos.redhat.com/hudson/job/jbosstools-javaee_4.3...
[INFO]
[INFO] --- tycho-p2-plugin:0.23.1:p2-metadata-default (default-p2-metadata-default) @
org.jboss.tools.seam.vpe.test ---
[INFO]
[INFO] --- repository-utils:0.23.1:generate-repository-facade (generate-facade) @
org.jboss.tools.seam.vpe.test ---
[INFO]
[INFO] --- tycho-pack200a-plugin:0.23.1:normalize (pack200-normalize) @
org.jboss.tools.seam.vpe.test ---
[INFO] Pack200 normalizing jar
<
http://jenkins.mw.lab.eng.bos.redhat.com/hudson/job/jbosstools-javaee_4.3...
[INFO]
[INFO] --- exec-maven-plugin:1.2.1:exec (jarsign) @ org.jboss.tools.seam.vpe.test ---
[INFO] skipping execute as per configuraion
[INFO]
[INFO] --- tycho-pack200b-plugin:0.23.1:pack (pack200-pack) @
org.jboss.tools.seam.vpe.test ---
[INFO] Pack200 packing jar
<
http://jenkins.mw.lab.eng.bos.redhat.com/hudson/job/jbosstools-javaee_4.3...
[INFO]
[INFO] --- tycho-p2-plugin:0.23.1:p2-metadata (attached-p2-metadata) @
org.jboss.tools.seam.vpe.test ---
[INFO]
[INFO] --- tycho-p2-plugin:0.23.1:p2-metadata (p2-metadata) @
org.jboss.tools.seam.vpe.test ---
[INFO]
[INFO] --- tycho-surefire-plugin:0.23.1:test (default-test) @
org.jboss.tools.seam.vpe.test ---
[INFO] Expected eclipse log file:
<
http://jenkins.mw.lab.eng.bos.redhat.com/hudson/job/jbosstools-javaee_4.3...
[INFO] Command line:
[/qa/tools/opt/x86_64/jdk1.8.0_60/jre/bin/java, -Dosgi.noShutdown=false, -Dosgi.os=linux,
-Dosgi.ws=gtk, -Dosgi.arch=x86_64,
-javaagent:<http://jenkins.mw.lab.eng.bos.redhat.com/hudson/job/jbosstools-javaee_4.3.mars/ws/.repository/org/jacoco/org.jacoco.agent/0.7.1.201405082137/org.jacoco.agent-0.7.1.201405082137-runtime.jar=destfile=/mnt/hudson_workspace/workspace/jbosstools-javaee_4.3.mars/sources/seam/target/jacoco.exec,append=true,includes=org.jboss.tools.seam.vpe*,>
-Xms512m, -Xmx1024m, -XX:PermSize=256m, -XX:MaxPermSize=256m,
-Dusage_reporting_enabled=false, -Dorg.jboss.tools.tests.skipPrivateRequirements=false,
-Dorg.eclipse.ui.testsDisableWorkbenchAutoSave=true, -Dosgi.clean=true, -jar,
<
http://jenkins.mw.lab.eng.bos.redhat.com/hudson/job/jbosstools-javaee_4.3...
-data,
<
http://jenkins.mw.lab.eng.bos.redhat.com/hudson/job/jbosstools-javaee_4.3...
-install,
<
http://jenkins.mw.lab.eng.bos.redhat.com/hudson/job/jbosstools-javaee_4.3...
-configuration,
<
http://jenkins.mw.lab.eng.bos.redhat.com/hudson/job/jbosstools-javaee_4.3...
-application, org.eclipse.tycho.surefire.osgibooter.uitest, -testproperties,
<
http://jenkins.mw.lab.eng.bos.redhat.com/hudson/job/jbosstools-javaee_4.3...
-product, org.jboss.tools.tests.product]
Java HotSpot(TM) 64-Bit Server VM warning: ignoring option PermSize=256m; support was
removed in 8.0
Java HotSpot(TM) 64-Bit Server VM warning: ignoring option MaxPermSize=256m; support was
removed in 8.0
-------------------------------------------------------
T E S T S
-------------------------------------------------------
Running org.jboss.tools.seam.vpe.test.SeamAllTests
Tests run: 65, Failures: 0, Errors: 0, Skipped: 0, Time elapsed: 34.478 sec - in
org.jboss.tools.seam.vpe.test.SeamAllTests
testJBIDE_1484(org.jboss.tools.seam.vpe.test.JBIDE1484Test) Time elapsed: 9.995 sec
testOpenOnForSDecorate(org.jboss.tools.seam.vpe.test.OpenOnForDecorateTest) Time elapsed:
1.463 sec
testValidateAll(org.jboss.tools.seam.vpe.test.SeamComponentContentTest) Time elapsed:
0.404 sec
testDefaultAction(org.jboss.tools.seam.vpe.test.SeamComponentContentTest) Time elapsed:
0.43 sec
testPdfChapter(org.jboss.tools.seam.vpe.test.SeamComponentContentTest) Time elapsed:
0.406 sec
testValidateFormattedText(org.jboss.tools.seam.vpe.test.SeamComponentContentTest) Time
elapsed: 0.421 sec
testConvertEnum(org.jboss.tools.seam.vpe.test.SeamComponentContentTest) Time elapsed:
0.428 sec
testGraphicImage(org.jboss.tools.seam.vpe.test.SeamComponentContentTest) Time elapsed:
0.362 sec
testDiv(org.jboss.tools.seam.vpe.test.SeamComponentContentTest) Time elapsed: 0.368 sec
testEnumItem(org.jboss.tools.seam.vpe.test.SeamComponentContentTest) Time elapsed: 0.614
sec
testPdfDocument(org.jboss.tools.seam.vpe.test.SeamComponentContentTest) Time elapsed:
0.346 sec
testCache(org.jboss.tools.seam.vpe.test.SeamComponentContentTest) Time elapsed: 0.346
sec
testLabel(org.jboss.tools.seam.vpe.test.SeamComponentContentTest) Time elapsed: 0.356
sec
testLink(org.jboss.tools.seam.vpe.test.SeamComponentContentTest) Time elapsed: 0.324 sec
testSpan(org.jboss.tools.seam.vpe.test.SeamComponentContentTest) Time elapsed: 0.331 sec
testPdfCell(org.jboss.tools.seam.vpe.test.SeamComponentContentTest) Time elapsed: 0.327
sec
testPdfData(org.jboss.tools.seam.vpe.test.SeamComponentContentTest) Time elapsed: 0.362
sec
testPdfFont(org.jboss.tools.seam.vpe.test.SeamComponentContentTest) Time elapsed: 0.336
sec
testPdfHTML(org.jboss.tools.seam.vpe.test.SeamComponentContentTest) Time elapsed: 0.364
sec
testPdfList(org.jboss.tools.seam.vpe.test.SeamComponentContentTest) Time elapsed: 0.357
sec
testPdfText(org.jboss.tools.seam.vpe.test.SeamComponentContentTest) Time elapsed: 0.35
sec
testFragment(org.jboss.tools.seam.vpe.test.SeamComponentContentTest) Time elapsed: 0.327
sec
testConvertEntity(org.jboss.tools.seam.vpe.test.SeamComponentContentTest) Time elapsed:
0.367 sec
testPdfListItem(org.jboss.tools.seam.vpe.test.SeamComponentContentTest) Time elapsed:
0.325 sec
testConvertDateTime(org.jboss.tools.seam.vpe.test.SeamComponentContentTest) Time elapsed:
0.354 sec
testPdfNewPage(org.jboss.tools.seam.vpe.test.SeamComponentContentTest) Time elapsed:
0.343 sec
testValidate(org.jboss.tools.seam.vpe.test.SeamComponentContentTest) Time elapsed: 0.377
sec
testPdfPageNumber(org.jboss.tools.seam.vpe.test.SeamComponentContentTest) Time elapsed:
0.388 sec
testPdfSection(org.jboss.tools.seam.vpe.test.SeamComponentContentTest) Time elapsed:
0.327 sec
testSelectItems(org.jboss.tools.seam.vpe.test.SeamComponentContentTest) Time elapsed:
0.328 sec
testPdfColor(org.jboss.tools.seam.vpe.test.SeamComponentContentTest) Time elapsed: 0.343
sec
testPdfImage(org.jboss.tools.seam.vpe.test.SeamComponentContentTest) Time elapsed: 0.34
sec
testPdfTable(org.jboss.tools.seam.vpe.test.SeamComponentContentTest) Time elapsed: 0.332
sec
testPdfParagraph(org.jboss.tools.seam.vpe.test.SeamComponentContentTest) Time elapsed:
0.318 sec
testFormattedText(org.jboss.tools.seam.vpe.test.SeamComponentContentTest) Time elapsed:
0.358 sec
testMailMessage(org.jboss.tools.seam.vpe.test.SeamComponentContentTest) Time elapsed:
0.332 sec
testTransformImageBlur(org.jboss.tools.seam.vpe.test.SeamComponentContentTest) Time
elapsed: 0.335 sec
testTransformImageSize(org.jboss.tools.seam.vpe.test.SeamComponentContentTest) Time
elapsed: 0.327 sec
testTransformImageType(org.jboss.tools.seam.vpe.test.SeamComponentContentTest) Time
elapsed: 0.356 sec
testMailReplyTo(org.jboss.tools.seam.vpe.test.SeamComponentContentTest) Time elapsed:
0.332 sec
testPdfBarChart(org.jboss.tools.seam.vpe.test.SeamComponentContentTest) Time elapsed:
0.372 sec
testMailBcc(org.jboss.tools.seam.vpe.test.SeamComponentContentTest) Time elapsed: 0.334
sec
testMessage(org.jboss.tools.seam.vpe.test.SeamComponentContentTest) Time elapsed: 0.308
sec
testPdfAnchor(org.jboss.tools.seam.vpe.test.SeamComponentContentTest) Time elapsed: 0.313
sec
testPdfLineChart(org.jboss.tools.seam.vpe.test.SeamComponentContentTest) Time elapsed:
0.352 sec
testMailBody(org.jboss.tools.seam.vpe.test.SeamComponentContentTest) Time elapsed: 0.353
sec
testMailFrom(org.jboss.tools.seam.vpe.test.SeamComponentContentTest) Time elapsed: 0.333
sec
testPdfFooter(org.jboss.tools.seam.vpe.test.SeamComponentContentTest) Time elapsed: 0.315
sec
testPdfHeader(org.jboss.tools.seam.vpe.test.SeamComponentContentTest) Time elapsed: 0.323
sec
testMailAttachment(org.jboss.tools.seam.vpe.test.SeamComponentContentTest) Time elapsed:
0.334 sec
testPdfSeries(org.jboss.tools.seam.vpe.test.SeamComponentContentTest) Time elapsed: 0.33
sec
testPdfStroke(org.jboss.tools.seam.vpe.test.SeamComponentContentTest) Time elapsed: 0.345
sec
testFileUpload(org.jboss.tools.seam.vpe.test.SeamComponentContentTest) Time elapsed:
0.303 sec
testButton(org.jboss.tools.seam.vpe.test.SeamComponentContentTest) Time elapsed: 0.615
sec
testDecorate(org.jboss.tools.seam.vpe.test.SeamComponentContentTest) Time elapsed: 0.319
sec
testConversationId(org.jboss.tools.seam.vpe.test.SeamComponentContentTest) Time elapsed:
0.309 sec
testPdfBarCode(org.jboss.tools.seam.vpe.test.SeamComponentContentTest) Time elapsed:
0.341 sec
testPdfPieChart(org.jboss.tools.seam.vpe.test.SeamComponentContentTest) Time elapsed:
0.361 sec
testMailCc(org.jboss.tools.seam.vpe.test.SeamComponentContentTest) Time elapsed: 0.335
sec
testMailTo(org.jboss.tools.seam.vpe.test.SeamComponentContentTest) Time elapsed: 0.33
sec
testRemote(org.jboss.tools.seam.vpe.test.SeamComponentContentTest) Time elapsed: 0.311
sec
testMailSubject(org.jboss.tools.seam.vpe.test.SeamComponentContentTest) Time elapsed:
0.335 sec
testTaskId(org.jboss.tools.seam.vpe.test.SeamComponentContentTest) Time elapsed: 0.408
sec
testSelectDate(org.jboss.tools.seam.vpe.test.SeamComponentContentTest) Time elapsed:
0.311 sec
testMailHeader(org.jboss.tools.seam.vpe.test.SeamComponentContentTest) Time elapsed:
0.321 sec
Results :
Tests run: 65, Failures: 0, Errors: 0, Skipped: 0
[INFO] All tests passed!
[INFO]
[INFO] --- repository-utils:0.23.1:compare-version-with-baselines (default) @
org.jboss.tools.seam.vpe.test ---
[INFO] Skipped
[INFO]
[INFO] ------------------------------------------------------------------------
[INFO] Building javaee.all.tests 4.3.1-SNAPSHOT
[INFO] ------------------------------------------------------------------------
[INFO]
[INFO] --- build-helper-maven-plugin:1.7:regex-property (regex-property) @
javaee.all.tests ---
[INFO] Setting property 'skipTestsOrITests' to ''.
[INFO]
[INFO] --- jacoco-maven-plugin:0.7.1.201405082137:prepare-agent (default) @
javaee.all.tests ---
[INFO] argLine set to
-javaagent:<http://jenkins.mw.lab.eng.bos.redhat.com/hudson/job/jbosstools-javaee_4.3.mars/ws/.repository/org/jacoco/org.jacoco.agent/0.7.1.201405082137/org.jacoco.agent-0.7.1.201405082137-runtime.jar=destfile=/mnt/hudson_workspace/workspace/jbosstools-javaee_4.3.mars/target/jacoco.exec,append=true,includes=org.jboss.tools.*>
[INFO]
[INFO] --- tycho-source-plugin:0.23.1:plugin-source (plugin-source) @ javaee.all.tests
---
[INFO]
[INFO] --- repository-utils:0.23.1:generate-repository-facade (generate-facade) @
javaee.all.tests ---
[INFO]
[INFO] --- tycho-pack200a-plugin:0.23.1:normalize (pack200-normalize) @ javaee.all.tests
---
[INFO]
[INFO] --- exec-maven-plugin:1.2.1:exec (jarsign) @ javaee.all.tests ---
[INFO] skipping execute as per configuraion
[INFO]
[INFO] --- tycho-pack200b-plugin:0.23.1:pack (pack200-pack) @ javaee.all.tests ---
[INFO]
[INFO] --- tycho-p2-plugin:0.23.1:p2-metadata (attached-p2-metadata) @ javaee.all.tests
---
[INFO]
[INFO] --- tycho-p2-plugin:0.23.1:p2-metadata (p2-metadata) @ javaee.all.tests ---
[INFO]
[INFO] --- repository-utils:0.23.1:compare-version-with-baselines (default) @
javaee.all.tests ---
[INFO] Skipped
[INFO] ------------------------------------------------------------------------
[INFO] Reactor Summary:
[INFO]
[INFO] batch.tests ........................................ SUCCESS [ 0.399 s]
[INFO] cdi.tests .......................................... SUCCESS [ 0.009 s]
[INFO] org.jboss.tools.cdi.core.test ...................... SUCCESS [07:41 min]
[INFO] org.jboss.tools.cdi.extension.core.test ............ SUCCESS [ 21.289 s]
[INFO] org.jboss.tools.cdi.seam.solder.core.test .......... SUCCESS [01:16 min]
[INFO] org.jboss.tools.cdi.seam.config.core.test .......... SUCCESS [ 35.830 s]
[INFO] org.jboss.tools.cdi.seam.config.ui.test ............ SUCCESS [ 29.060 s]
[INFO] org.jboss.tools.cdi.seam.core.test ................. SUCCESS [ 39.184 s]
[INFO] org.jboss.tools.cdi.seam.faces.core.test ........... SUCCESS [ 45.010 s]
[INFO] org.jboss.tools.cdi.text.ext.test .................. SUCCESS [01:44 min]
[INFO] org.jboss.tools.cdi.seam.text.ext.test ............. SUCCESS [01:17 min]
[INFO] org.jboss.tools.cdi.ui.test ........................ SUCCESS [04:40 min]
[INFO] org.jboss.tools.cdi.deltaspike.core.test ........... SUCCESS [ 23.738 s]
[INFO] jsf.tests .......................................... SUCCESS [ 0.005 s]
[INFO] org.jboss.tools.jsf.base.test ...................... SUCCESS [ 2.406 s]
[INFO] org.jboss.tools.jsf.test ........................... SUCCESS [01:53 min]
[INFO] org.jboss.tools.jsf.text.ext.test .................. SUCCESS [01:20 min]
[INFO] org.jboss.tools.jsf.ui.test ........................ SUCCESS [06:06 min]
[INFO] org.jboss.tools.jsf.verification.test .............. SUCCESS [ 21.795 s]
[INFO] org.jboss.tools.jsf.vpe.ajax4jsf.test .............. SUCCESS [ 28.628 s]
[INFO] org.jboss.tools.jsf.vpe.facelets.test .............. SUCCESS [ 29.634 s]
[INFO] org.jboss.tools.jsf.vpe.jbpm.test .................. SUCCESS [ 19.964 s]
[INFO] org.jboss.tools.jsf.vpe.jsf.test ................... SUCCESS [04:17 min]
[INFO] org.jboss.tools.jsf.vpe.jstl.test .................. SUCCESS [ 35.450 s]
[INFO] org.jboss.tools.jsf.vpe.myfaces.test ............... SUCCESS [ 33.614 s]
[INFO] org.jboss.tools.jsf.vpe.richfaces.test ............. SUCCESS [01:07 min]
[INFO] seam.tests ......................................... SUCCESS [ 0.006 s]
[INFO] org.jboss.tools.seam.base.test ..................... SUCCESS [ 13.367 s]
[INFO] org.jboss.tools.seam.core.test ..................... SUCCESS [02:53 min]
[INFO] org.jboss.tools.seam.pages.xml.test ................ SUCCESS [ 14.350 s]
[INFO] org.jboss.tools.seam.ui.test ....................... FAILURE [30:40 min]
[INFO] org.jboss.tools.seam.xml.test ...................... SUCCESS [ 11.958 s]
[INFO] org.jboss.tools.seam121EAP.core.test ............... SUCCESS [01:18 min]
[INFO] org.jboss.tools.seam121EAP.ui.test ................. SUCCESS [01:16 min]
[INFO] org.jboss.tools.seam212GA.core.test ................ SUCCESS [01:41 min]
[INFO] org.jboss.tools.seam212GA.ui.test .................. SUCCESS [01:27 min]
[INFO] org.jboss.tools.seam221GA.core.test ................ SUCCESS [01:36 min]
[INFO] org.jboss.tools.seam221GA.ui.test .................. SUCCESS [01:25 min]
[INFO] org.jboss.tools.seam230.core.test .................. SUCCESS [01:28 min]
[INFO] org.jboss.tools.seam230.ui.test .................... SUCCESS [01:10 min]
[INFO] org.jboss.tools.seamfp.core.test ................... SUCCESS [01:45 min]
[INFO] org.jboss.tools.seamfp.ui.test ..................... SUCCESS [01:31 min]
[INFO] org.jboss.tools.runtime.seam.detector.test ......... SUCCESS [ 56.532 s]
[INFO] org.jboss.tools.seam.vpe.test ...................... SUCCESS [ 46.888 s]
[INFO] javaee.all.tests ................................... SUCCESS [ 0.004 s]
[INFO] ------------------------------------------------------------------------
[INFO] BUILD FAILURE
[INFO] ------------------------------------------------------------------------
[INFO] Total time: 01:28 h
[INFO] Finished at: 2015-11-20T14:38:20-05:00
[INFO] Final Memory: 169M/807M
[INFO] ------------------------------------------------------------------------
[ERROR] Failed to execute goal org.eclipse.tycho:tycho-surefire-plugin:0.23.1:test
(default-test) on project org.jboss.tools.seam.ui.test: An unexpected error occured while
launching the test runtime (return code 143). See log for details. -> [Help 1]
org.apache.maven.lifecycle.LifecycleExecutionException: Failed to execute goal
org.eclipse.tycho:tycho-surefire-plugin:0.23.1:test (default-test) on project
org.jboss.tools.seam.ui.test: An unexpected error occured while launching the test runtime
(return code 143). See log for details.
at org.apache.maven.lifecycle.internal.MojoExecutor.execute(MojoExecutor.java:212)
at org.apache.maven.lifecycle.internal.MojoExecutor.execute(MojoExecutor.java:153)
at org.apache.maven.lifecycle.internal.MojoExecutor.execute(MojoExecutor.java:145)
at
org.apache.maven.lifecycle.internal.LifecycleModuleBuilder.buildProject(LifecycleModuleBuilder.java:116)
at
org.apache.maven.lifecycle.internal.LifecycleModuleBuilder.buildProject(LifecycleModuleBuilder.java:80)
at
org.apache.maven.lifecycle.internal.builder.singlethreaded.SingleThreadedBuilder.build(SingleThreadedBuilder.java:51)
at
org.apache.maven.lifecycle.internal.LifecycleStarter.execute(LifecycleStarter.java:120)
at org.apache.maven.DefaultMaven.doExecute(DefaultMaven.java:355)
at org.apache.maven.DefaultMaven.execute(DefaultMaven.java:155)
at org.apache.maven.cli.MavenCli.execute(MavenCli.java:584)
at org.apache.maven.cli.MavenCli.doMain(MavenCli.java:216)
at org.apache.maven.cli.MavenCli.main(MavenCli.java:160)
at sun.reflect.NativeMethodAccessorImpl.invoke0(Native Method)
at sun.reflect.NativeMethodAccessorImpl.invoke(NativeMethodAccessorImpl.java:62)
at sun.reflect.DelegatingMethodAccessorImpl.invoke(DelegatingMethodAccessorImpl.java:43)
at java.lang.reflect.Method.invoke(Method.java:497)
at org.codehaus.plexus.classworlds.launcher.Launcher.launchEnhanced(Launcher.java:289)
at org.codehaus.plexus.classworlds.launcher.Launcher.launch(Launcher.java:229)
at org.codehaus.plexus.classworlds.launcher.Launcher.mainWithExitCode(Launcher.java:415)
at org.codehaus.plexus.classworlds.launcher.Launcher.main(Launcher.java:356)
Caused by: org.apache.maven.plugin.MojoFailureException: An unexpected error occured while
launching the test runtime (return code 143). See log for details.
at org.eclipse.tycho.surefire.TestMojo.runTest(TestMojo.java:950)
at org.eclipse.tycho.surefire.TestMojo.execute(TestMojo.java:630)
at
org.apache.maven.plugin.DefaultBuildPluginManager.executeMojo(DefaultBuildPluginManager.java:132)
at org.apache.maven.lifecycle.internal.MojoExecutor.execute(MojoExecutor.java:208)
... 19 more
[ERROR]
[ERROR] Re-run Maven using the -X switch to enable full debug logging.
[ERROR]
[ERROR] For more information about the errors and possible solutions, please read the
following articles:
[ERROR] [Help 1]
http://cwiki.apache.org/confluence/display/MAVEN/MojoFailureException
[ERROR]
[ERROR] After correcting the problems, you can resume the build with the command
[ERROR] mvn <goals> -rf :org.jboss.tools.seam.ui.test
Build step 'Invoke top-level Maven targets' marked build as failure
Terminating xvnc.
$ vncserver -kill :83
Killing Xvnc process ID 28496
Archiving artifacts
Recording test results
[description-setter] Description set: