JBoss List Archives
Sign In
Sign Up
Sign In
Sign Up
Manage this list
2026
October
September
August
July
June
May
April
March
February
January
2025
December
November
October
September
August
July
June
May
April
March
February
January
2024
December
November
October
September
August
July
June
May
April
March
February
January
2023
December
November
October
September
August
July
June
May
April
March
February
January
2022
December
November
October
September
August
July
June
May
April
March
February
January
2021
December
November
October
September
August
July
June
May
April
March
February
January
2020
December
November
October
September
August
July
June
May
April
March
February
January
2019
December
November
October
September
August
July
June
May
April
March
February
January
2018
December
November
October
September
August
July
June
May
April
March
February
January
2017
December
November
October
September
August
July
June
May
April
March
February
January
2016
December
November
October
September
August
July
June
May
April
March
February
January
2015
December
November
October
September
August
July
June
May
April
March
February
January
2014
December
November
October
September
August
July
June
May
April
March
February
January
2013
December
November
October
September
August
July
June
May
April
March
February
January
2012
December
November
October
September
August
July
June
May
April
March
February
January
2011
December
November
October
September
August
July
June
May
April
March
February
January
2010
December
November
October
September
August
July
June
May
April
March
February
January
2009
December
November
October
September
August
July
June
May
April
March
February
January
List overview
Download
thread
[jbosstools-builds] Build failed in Jenkins: jbosstools-build-sites.aggregate.site_master #8696
ci-builds@redhat.com
Friday, 7 March 2014
Fri, 7 Mar '14
4 p.m.
See <
http://jenkins.mw.lab.eng.bos.redhat.com/hudson/job/jbosstools-build-site...
------------------------------------------ [...truncated 512 lines...] [INFO] Downloaded:
https://repository.jboss.org/nexus/content/groups/developer/org/powermock...
(82 KB at 249.8 KB/sec) [INFO] Downloading:
https://repository.jboss.org/nexus/content/groups/developer/org/objenesis...
[INFO] Downloaded:
https://repository.jboss.org/nexus/content/groups/developer/org/objenesis...
(41 KB at 169.2 KB/sec) [INFO] Downloading:
https://repository.jboss.org/nexus/content/groups/developer/org/powermock...
[INFO] Downloaded:
https://repository.jboss.org/nexus/content/groups/developer/org/powermock...
(43 KB at 155.9 KB/sec) [INFO] Downloading:
https://repository.jboss.org/nexus/content/groups/developer/junit/junit/4...
[INFO] Downloaded:
https://repository.jboss.org/nexus/content/groups/developer/org/powermock...
(24 KB at 74.4 KB/sec) [INFO] Downloading:
https://repository.jboss.org/nexus/content/groups/developer/org/powermock...
[INFO] Downloaded:
https://repository.jboss.org/nexus/content/groups/developer/org/powermock...
(14 KB at 55.7 KB/sec) [INFO] Downloaded:
https://repository.jboss.org/nexus/content/groups/developer/junit/junit/4...
(240 KB at 360.4 KB/sec) [INFO] Downloaded:
https://repository.jboss.org/nexus/content/groups/developer/org/javassist...
(698 KB at 636.4 KB/sec) [INFO] Downloaded:
https://repository.jboss.org/nexus/content/groups/developer/org/eclipse/j...
(1811 KB at 574.4 KB/sec) [INFO] Downloaded:
https://repository.jboss.org/nexus/content/groups/developer/org/mockito/m...
(1545 KB at 578.3 KB/sec) [INFO] Downloading:
http://repository.jboss.org/maven2/commons-io/commons-io/2.4/commons-io-2...
[INFO] Downloading:
http://repository.jboss.org/maven2/org/apache/maven/shared/maven-filterin...
[INFO] Downloading:
http://repository.jboss.org/maven2/org/codehaus/plexus/plexus-utils/1.5.1...
[INFO] Downloading:
http://repository.jboss.org/maven2/org/codehaus/plexus/plexus-interpolati...
[INFO] Downloading:
http://repository.jboss.org/maven2/org/sonatype/plexus/plexus-build-api/0...
[INFO] Downloading:
http://repository.jboss.org/maven2/org/eclipse/jgit/org.eclipse.jgit/3.2....
[INFO] Downloading:
http://repository.jboss.org/maven2/org/hamcrest/hamcrest-library/1.3/hamc...
[INFO] Downloading:
http://repository.jboss.org/maven2/org/hamcrest/hamcrest-core/1.3/hamcres...
[INFO] Downloading:
http://repository.jboss.org/maven2/org/powermock/powermock-api-mockito/1....
[INFO] Downloading:
http://repository.jboss.org/maven2/org/mockito/mockito-all/1.9.5/mockito-...
[INFO] Downloading:
http://repository.jboss.org/maven2/org/powermock/powermock-api-support/1....
[INFO] Downloading:
http://repository.jboss.org/maven2/org/powermock/powermock-core/1.5.4/pow...
[INFO] Downloading:
http://repository.jboss.org/maven2/org/javassist/javassist/3.18.1-GA/java...
[INFO] Downloading:
http://repository.jboss.org/maven2/org/powermock/powermock-reflect/1.5.4/...
[INFO] Downloading:
http://repository.jboss.org/maven2/org/objenesis/objenesis/2.1/objenesis-...
[INFO] Downloading:
http://repository.jboss.org/maven2/org/powermock/powermock-module-junit4/...
[INFO] Downloading:
http://repository.jboss.org/maven2/junit/junit/4.11/junit-4.11.jar
[INFO] Downloading:
http://repository.jboss.org/maven2/org/powermock/powermock-module-junit4-...
[INFO] Downloading:
http://snapshots.jboss.org/maven2/commons-io/commons-io/2.4/commons-io-2....
[INFO] Downloading:
http://snapshots.jboss.org/maven2/org/apache/maven/shared/maven-filtering...
[INFO] Downloading:
http://snapshots.jboss.org/maven2/org/codehaus/plexus/plexus-utils/1.5.15...
[INFO] Downloading:
http://snapshots.jboss.org/maven2/org/codehaus/plexus/plexus-interpolatio...
[INFO] Downloading:
http://snapshots.jboss.org/maven2/org/sonatype/plexus/plexus-build-api/0....
[INFO] Downloading:
http://snapshots.jboss.org/maven2/org/eclipse/jgit/org.eclipse.jgit/3.2.0...
[INFO] Downloading:
http://snapshots.jboss.org/maven2/org/hamcrest/hamcrest-library/1.3/hamcr...
[INFO] Downloading:
http://snapshots.jboss.org/maven2/org/hamcrest/hamcrest-core/1.3/hamcrest...
[INFO] Downloading:
http://snapshots.jboss.org/maven2/org/powermock/powermock-api-mockito/1.5...
[INFO] Downloading:
http://snapshots.jboss.org/maven2/org/mockito/mockito-all/1.9.5/mockito-a...
[INFO] Downloading:
http://snapshots.jboss.org/maven2/org/powermock/powermock-api-support/1.5...
[INFO] Downloading:
http://snapshots.jboss.org/maven2/org/powermock/powermock-core/1.5.4/powe...
[INFO] Downloading:
http://snapshots.jboss.org/maven2/org/javassist/javassist/3.18.1-GA/javas...
[INFO] Downloading:
http://snapshots.jboss.org/maven2/org/powermock/powermock-reflect/1.5.4/p...
[INFO] Downloading:
http://snapshots.jboss.org/maven2/org/objenesis/objenesis/2.1/objenesis-2...
[INFO] Downloading:
http://snapshots.jboss.org/maven2/org/powermock/powermock-module-junit4/1...
[INFO] Downloading:
http://snapshots.jboss.org/maven2/junit/junit/4.11/junit-4.11.jar
[INFO] Downloading:
http://snapshots.jboss.org/maven2/org/powermock/powermock-module-junit4-c...
[INFO] Downloading:
https://repository.sonatype.org/content/groups/sonatype-public-grid/commo...
[INFO] Downloading:
https://repository.sonatype.org/content/groups/sonatype-public-grid/org/a...
[INFO] Downloading:
https://repository.sonatype.org/content/groups/sonatype-public-grid/org/c...
[INFO] Downloading:
https://repository.sonatype.org/content/groups/sonatype-public-grid/org/c...
[INFO] Downloading:
https://repository.sonatype.org/content/groups/sonatype-public-grid/org/s...
[INFO] Downloaded:
https://repository.sonatype.org/content/groups/sonatype-public-grid/org/s...
(7 KB at 12.4 KB/sec) [INFO] Downloading:
https://repository.sonatype.org/content/groups/sonatype-public-grid/org/e...
[INFO] Downloaded:
https://repository.sonatype.org/content/groups/sonatype-public-grid/org/a...
(43 KB at 57.7 KB/sec) [INFO] Downloading:
https://repository.sonatype.org/content/groups/sonatype-public-grid/org/h...
[INFO] Downloaded:
https://repository.sonatype.org/content/groups/sonatype-public-grid/org/c...
(60 KB at 71.3 KB/sec) [INFO] Downloading:
https://repository.sonatype.org/content/groups/sonatype-public-grid/org/h...
[INFO] Downloaded:
https://repository.sonatype.org/content/groups/sonatype-public-grid/org/h...
(52 KB at 178.1 KB/sec) [INFO] Downloading:
https://repository.sonatype.org/content/groups/sonatype-public-grid/org/p...
[INFO] Downloaded:
https://repository.sonatype.org/content/groups/sonatype-public-grid/commo...
(181 KB at 168.5 KB/sec) [INFO] Downloading:
https://repository.sonatype.org/content/groups/sonatype-public-grid/org/m...
[INFO] Downloaded:
https://repository.sonatype.org/content/groups/sonatype-public-grid/org/c...
(223 KB at 207.2 KB/sec) [INFO] Downloading:
https://repository.sonatype.org/content/groups/sonatype-public-grid/org/p...
[INFO] Downloaded:
https://repository.sonatype.org/content/groups/sonatype-public-grid/org/h...
(44 KB at 153.2 KB/sec) [INFO] Downloading:
https://repository.sonatype.org/content/groups/sonatype-public-grid/org/p...
[INFO] Downloaded:
https://repository.sonatype.org/content/groups/sonatype-public-grid/org/p...
(19 KB at 88.4 KB/sec) [INFO] Downloading:
https://repository.sonatype.org/content/groups/sonatype-public-grid/org/j...
[INFO] Downloaded:
https://repository.sonatype.org/content/groups/sonatype-public-grid/org/p...
(69 KB at 218.3 KB/sec) [INFO] Downloading:
https://repository.sonatype.org/content/groups/sonatype-public-grid/org/p...
[INFO] Downloaded:
https://repository.sonatype.org/content/groups/sonatype-public-grid/org/p...
(82 KB at 252.9 KB/sec) [INFO] Downloading:
https://repository.sonatype.org/content/groups/sonatype-public-grid/org/o...
[INFO] Downloaded:
https://repository.sonatype.org/content/groups/sonatype-public-grid/org/p...
(43 KB at 170.4 KB/sec) [INFO] Downloading:
https://repository.sonatype.org/content/groups/sonatype-public-grid/org/p...
[INFO] Downloaded:
https://repository.sonatype.org/content/groups/sonatype-public-grid/org/o...
(41 KB at 190.5 KB/sec) [INFO] Downloading:
https://repository.sonatype.org/content/groups/sonatype-public-grid/junit...
[INFO] Downloaded:
https://repository.sonatype.org/content/groups/sonatype-public-grid/org/p...
(24 KB at 117.2 KB/sec) [INFO] Downloading:
https://repository.sonatype.org/content/groups/sonatype-public-grid/org/p...
[INFO] Downloaded:
https://repository.sonatype.org/content/groups/sonatype-public-grid/org/p...
(14 KB at 79.5 KB/sec) [INFO] Downloaded:
https://repository.sonatype.org/content/groups/sonatype-public-grid/junit...
(240 KB at 462.0 KB/sec) [INFO] Downloaded:
https://repository.sonatype.org/content/groups/sonatype-public-grid/org/j...
(698 KB at 643.4 KB/sec) [INFO] Downloaded:
https://repository.sonatype.org/content/groups/sonatype-public-grid/org/e...
(1811 KB at 524.8 KB/sec) [INFO] Downloaded:
https://repository.sonatype.org/content/groups/sonatype-public-grid/org/m...
(1545 KB at 509.1 KB/sec) [INFO] Downloading:
https://oss.sonatype.org/content/groups/public/commons-io/commons-io/2.4/...
[INFO] Downloading:
https://oss.sonatype.org/content/groups/public/org/apache/maven/shared/ma...
[INFO] Downloading:
https://oss.sonatype.org/content/groups/public/org/codehaus/plexus/plexus...
[INFO] Downloading:
https://oss.sonatype.org/content/groups/public/org/codehaus/plexus/plexus...
[INFO] Downloading:
https://oss.sonatype.org/content/groups/public/org/sonatype/plexus/plexus...
[INFO] Downloading:
https://oss.sonatype.org/content/groups/public/org/eclipse/jgit/org.eclip...
[INFO] Downloading:
https://oss.sonatype.org/content/groups/public/org/hamcrest/hamcrest-libr...
[INFO] Downloading:
https://oss.sonatype.org/content/groups/public/org/hamcrest/hamcrest-core...
[INFO] Downloading:
https://oss.sonatype.org/content/groups/public/org/powermock/powermock-ap...
[INFO] Downloading:
https://oss.sonatype.org/content/groups/public/org/mockito/mockito-all/1....
[INFO] Downloaded:
https://oss.sonatype.org/content/groups/public/org/hamcrest/hamcrest-core...
(44 KB at 55.2 KB/sec) [INFO] Downloading:
https://oss.sonatype.org/content/groups/public/org/powermock/powermock-ap...
[INFO] Downloaded:
https://oss.sonatype.org/content/groups/public/org/hamcrest/hamcrest-libr...
(52 KB at 61.8 KB/sec) [INFO] Downloading:
https://oss.sonatype.org/content/groups/public/org/powermock/powermock-co...
[INFO] Downloaded:
https://oss.sonatype.org/content/groups/public/org/powermock/powermock-ap...
(69 KB at 70.3 KB/sec) [INFO] Downloading:
https://oss.sonatype.org/content/groups/public/org/javassist/javassist/3....
[INFO] Downloaded:
https://oss.sonatype.org/content/groups/public/org/powermock/powermock-ap...
(19 KB at 47.8 KB/sec) [INFO] Downloading:
https://oss.sonatype.org/content/groups/public/org/powermock/powermock-re...
[INFO] Downloaded:
https://oss.sonatype.org/content/groups/public/org/powermock/powermock-co...
(82 KB at 195.5 KB/sec) [INFO] Downloading:
https://oss.sonatype.org/content/groups/public/org/objenesis/objenesis/2....
[INFO] Downloaded:
https://oss.sonatype.org/content/groups/public/org/objenesis/objenesis/2....
(41 KB at 178.8 KB/sec) [INFO] Downloading:
https://oss.sonatype.org/content/groups/public/org/powermock/powermock-mo...
[INFO] Downloaded:
https://oss.sonatype.org/content/groups/public/org/powermock/powermock-re...
(43 KB at 126.5 KB/sec) [INFO] Downloading:
https://oss.sonatype.org/content/groups/public/junit/junit/4.11/junit-4.1...
[INFO] Downloaded:
https://oss.sonatype.org/content/groups/public/org/powermock/powermock-mo...
(24 KB at 77.1 KB/sec) [INFO] Downloading:
https://oss.sonatype.org/content/groups/public/org/powermock/powermock-mo...
[INFO] Downloaded:
https://oss.sonatype.org/content/groups/public/org/javassist/javassist/3....
(698 KB at 621.1 KB/sec) [INFO] Downloaded:
https://oss.sonatype.org/content/groups/public/junit/junit/4.11/junit-4.1...
(240 KB at 400.2 KB/sec) [INFO] Downloaded:
https://oss.sonatype.org/content/groups/public/org/powermock/powermock-mo...
(14 KB at 37.1 KB/sec) [INFO] Downloaded:
https://oss.sonatype.org/content/groups/public/org/eclipse/jgit/org.eclip...
(1811 KB at 596.2 KB/sec) [INFO] Downloaded:
https://oss.sonatype.org/content/groups/public/org/mockito/mockito-all/1....
(1545 KB at 488.8 KB/sec) [INFO] Downloading:
https://repository.jboss.org/nexus/content/repositories/releases/commons-...
[INFO] Downloading:
https://repository.jboss.org/nexus/content/repositories/releases/org/apac...
[INFO] Downloading:
https://repository.jboss.org/nexus/content/repositories/releases/org/code...
[INFO] Downloading:
https://repository.jboss.org/nexus/content/repositories/releases/org/code...
[INFO] Downloading:
https://repository.jboss.org/nexus/content/repositories/releases/org/sona...
[INFO] Downloading:
https://repository.jboss.org/nexus/content/repositories/releases/org/ecli...
[INFO] Downloading:
https://repository.jboss.org/nexus/content/repositories/releases/org/hamc...
[INFO] Downloading:
https://repository.jboss.org/nexus/content/repositories/releases/org/hamc...
[INFO] Downloading:
https://repository.jboss.org/nexus/content/repositories/releases/org/powe...
[INFO] Downloading:
https://repository.jboss.org/nexus/content/repositories/releases/org/mock...
[INFO] Downloading:
https://repository.jboss.org/nexus/content/repositories/releases/org/powe...
[INFO] Downloading:
https://repository.jboss.org/nexus/content/repositories/releases/org/powe...
[INFO] Downloading:
https://repository.jboss.org/nexus/content/repositories/releases/org/java...
[INFO] Downloading:
https://repository.jboss.org/nexus/content/repositories/releases/org/powe...
[INFO] Downloading:
https://repository.jboss.org/nexus/content/repositories/releases/org/obje...
[INFO] Downloading:
https://repository.jboss.org/nexus/content/repositories/releases/org/powe...
[INFO] Downloading:
https://repository.jboss.org/nexus/content/repositories/releases/junit/ju...
[INFO] Downloading:
https://repository.jboss.org/nexus/content/repositories/releases/org/powe...
[INFO] Downloaded:
https://repository.jboss.org/nexus/content/repositories/releases/org/java...
(698 KB at 361.9 KB/sec) [INFO] Downloading:
https://repository.jboss.org/nexus/content/repositories/snapshots/commons...
[INFO] Downloading:
https://repository.jboss.org/nexus/content/repositories/snapshots/org/apa...
[INFO] Downloading:
https://repository.jboss.org/nexus/content/repositories/snapshots/org/cod...
[INFO] Downloading:
https://repository.jboss.org/nexus/content/repositories/snapshots/org/son...
[INFO] Downloading:
https://repository.jboss.org/nexus/content/repositories/snapshots/org/cod...
[INFO] Downloading:
https://repository.jboss.org/nexus/content/repositories/snapshots/org/ecl...
[INFO] Downloading:
https://repository.jboss.org/nexus/content/repositories/snapshots/org/ham...
[INFO] Downloading:
https://repository.jboss.org/nexus/content/repositories/snapshots/org/ham...
[INFO] Downloading:
https://repository.jboss.org/nexus/content/repositories/snapshots/org/pow...
[INFO] Downloading:
https://repository.jboss.org/nexus/content/repositories/snapshots/org/moc...
[INFO] Downloading:
https://repository.jboss.org/nexus/content/repositories/snapshots/org/pow...
[INFO] Downloading:
https://repository.jboss.org/nexus/content/repositories/snapshots/org/pow...
[INFO] Downloading:
https://repository.jboss.org/nexus/content/repositories/snapshots/org/jav...
[INFO] Downloading:
https://repository.jboss.org/nexus/content/repositories/snapshots/org/pow...
[INFO] Downloading:
https://repository.jboss.org/nexus/content/repositories/snapshots/org/obj...
[INFO] Downloading:
https://repository.jboss.org/nexus/content/repositories/snapshots/org/pow...
[INFO] Downloading:
https://repository.jboss.org/nexus/content/repositories/snapshots/junit/j...
[INFO] Downloading:
https://repository.jboss.org/nexus/content/repositories/snapshots/org/pow...
[INFO] Downloading:
http://repo.maven.apache.org/maven2/commons-io/commons-io/2.4/commons-io-...
[INFO] Downloading:
http://repo.maven.apache.org/maven2/org/apache/maven/shared/maven-filteri...
[INFO] Downloading:
http://repo.maven.apache.org/maven2/org/codehaus/plexus/plexus-utils/1.5....
[INFO] Downloading:
http://repo.maven.apache.org/maven2/org/codehaus/plexus/plexus-interpolat...
[INFO] Downloading:
http://repo.maven.apache.org/maven2/org/sonatype/plexus/plexus-build-api/...
[INFO] Downloaded:
http://repo.maven.apache.org/maven2/org/sonatype/plexus/plexus-build-api/...
(7 KB at 44.0 KB/sec) [INFO] Downloading:
http://repo.maven.apache.org/maven2/org/eclipse/jgit/org.eclipse.jgit/3.2...
[INFO] Downloaded:
http://repo.maven.apache.org/maven2/org/apache/maven/shared/maven-filteri...
(43 KB at 214.8 KB/sec) [INFO] Downloading:
http://repo.maven.apache.org/maven2/org/hamcrest/hamcrest-library/1.3/ham...
[INFO] Downloaded:
http://repo.maven.apache.org/maven2/org/codehaus/plexus/plexus-interpolat...
(60 KB at 267.0 KB/sec) [INFO] Downloading:
http://repo.maven.apache.org/maven2/org/hamcrest/hamcrest-core/1.3/hamcre...
[INFO] Downloaded:
http://repo.maven.apache.org/maven2/org/hamcrest/hamcrest-core/1.3/hamcre...
(44 KB at 396.1 KB/sec) [INFO] Downloading:
http://repo.maven.apache.org/maven2/org/powermock/powermock-api-mockito/1...
[INFO] Downloaded:
http://repo.maven.apache.org/maven2/org/hamcrest/hamcrest-library/1.3/ham...
(52 KB at 292.8 KB/sec) [INFO] Downloading:
http://repo.maven.apache.org/maven2/org/mockito/mockito-all/1.9.5/mockito...
[INFO] Downloaded:
http://repo.maven.apache.org/maven2/commons-io/commons-io/2.4/commons-io-...
(181 KB at 422.4 KB/sec) [INFO] Downloading:
http://repo.maven.apache.org/maven2/org/powermock/powermock-api-support/1...
[INFO] Downloaded:
http://repo.maven.apache.org/maven2/org/codehaus/plexus/plexus-utils/1.5....
(223 KB at 484.3 KB/sec) [INFO] Downloading:
http://repo.maven.apache.org/maven2/org/powermock/powermock-core/1.5.4/po...
[INFO] Downloaded:
http://repo.maven.apache.org/maven2/org/powermock/powermock-api-mockito/1...
(69 KB at 476.3 KB/sec) [INFO] Downloading:
http://repo.maven.apache.org/maven2/org/javassist/javassist/3.18.1-GA/jav...
[INFO] Downloaded:
http://repo.maven.apache.org/maven2/org/powermock/powermock-api-support/1...
(19 KB at 220.9 KB/sec) [INFO] Downloading:
http://repo.maven.apache.org/maven2/org/powermock/powermock-reflect/1.5.4...
[INFO] Downloaded:
http://repo.maven.apache.org/maven2/org/powermock/powermock-reflect/1.5.4...
(43 KB at 373.9 KB/sec) [INFO] Downloading:
http://repo.maven.apache.org/maven2/org/objenesis/objenesis/2.1/objenesis...
[INFO] Downloaded:
http://repo.maven.apache.org/maven2/org/powermock/powermock-core/1.5.4/po...
(82 KB at 460.3 KB/sec) [INFO] Downloading:
http://repo.maven.apache.org/maven2/org/powermock/powermock-module-junit4...
[INFO] Downloaded:
http://repo.maven.apache.org/maven2/org/powermock/powermock-module-junit4...
(24 KB at 207.1 KB/sec) [INFO] Downloading:
http://repo.maven.apache.org/maven2/junit/junit/4.11/junit-4.11.jar
[INFO] Downloaded:
http://repo.maven.apache.org/maven2/org/objenesis/objenesis/2.1/objenesis...
(41 KB at 277.4 KB/sec) [INFO] Downloading:
http://repo.maven.apache.org/maven2/org/powermock/powermock-module-junit4...
[INFO] Downloaded:
http://repo.maven.apache.org/maven2/org/powermock/powermock-module-junit4...
(14 KB at 116.7 KB/sec) [INFO] Downloaded:
http://repo.maven.apache.org/maven2/junit/junit/4.11/junit-4.11.jar
(240 KB at 586.5 KB/sec) [INFO] Downloaded:
http://repo.maven.apache.org/maven2/org/javassist/javassist/3.18.1-GA/jav...
(698 KB at 845.4 KB/sec) [INFO] Downloaded:
http://repo.maven.apache.org/maven2/org/eclipse/jgit/org.eclipse.jgit/3.2...
(1811 KB at 953.6 KB/sec) [INFO] Downloaded:
http://repo.maven.apache.org/maven2/org/mockito/mockito-all/1.9.5/mockito...
(1545 KB at 691.8 KB/sec) [INFO] [INFO] --- tycho-source-plugin:0.19.0:plugin-source (plugin-source) @ org.jboss.tools.site.core --- [INFO] [INFO] --- tycho-p2-publisher-plugin:0.19.0:publish-products (default-publish-products) @ org.jboss.tools.site.core --- [INFO] [INFO] --- tycho-p2-publisher-plugin:0.19.0:publish-categories (default-publish-categories) @ org.jboss.tools.site.core --- [INFO] [INFO] --- tycho-p2-publisher-plugin:0.19.0:attach-artifacts (default-attach-artifacts) @ org.jboss.tools.site.core --- [INFO] [INFO] --- tycho-p2-repository-plugin:0.19.0:assemble-repository (default-assemble-repository) @ org.jboss.tools.site.core --- [INFO] [INFO] --- tycho-p2-repository-plugin:0.19.0:archive-repository (default-archive-repository) @ org.jboss.tools.site.core --- [INFO] Building zip: <
http://jenkins.mw.lab.eng.bos.redhat.com/hudson/job/jbosstools-build-site...
[INFO] [INFO] --- repository-utils:0.19.0-SNAPSHOT:generate-repository-facade (generate-facade) @ org.jboss.tools.site.core --- [INFO] Building zip: <
http://jenkins.mw.lab.eng.bos.redhat.com/hudson/job/jbosstools-build-site...
[INFO] [INFO] --- repository-utils:0.19.0-SNAPSHOT:fetch-sources-from-manifests (fetch-sources) @ org.jboss.tools.site.core --- [INFO] ------------------------------------------------------------------------ [INFO] BUILD FAILURE [INFO] ------------------------------------------------------------------------ [INFO] Total time: 7:40.235s [INFO] Finished at: Fri Mar 07 17:00:16 EST 2014 [INFO] Final Memory: 97M/537M [INFO] ------------------------------------------------------------------------ [ERROR] Failed to execute goal org.jboss.tools.tycho-plugins:repository-utils:0.19.0-SNAPSHOT:fetch-sources-from-manifests (fetch-sources) on project org.jboss.tools.site.core: target/repository/plugins is not a directory. -> [Help 1] org.apache.maven.lifecycle.LifecycleExecutionException: Failed to execute goal org.jboss.tools.tycho-plugins:repository-utils:0.19.0-SNAPSHOT:fetch-sources-from-manifests (fetch-sources) on project org.jboss.tools.site.core: target/repository/plugins is not a directory. at org.apache.maven.lifecycle.internal.MojoExecutor.execute(MojoExecutor.java:216) at org.apache.maven.lifecycle.internal.MojoExecutor.execute(MojoExecutor.java:153) at org.apache.maven.lifecycle.internal.MojoExecutor.execute(MojoExecutor.java:145) at org.apache.maven.lifecycle.internal.LifecycleModuleBuilder.buildProject(LifecycleModuleBuilder.java:84) at org.apache.maven.lifecycle.internal.LifecycleModuleBuilder.buildProject(LifecycleModuleBuilder.java:59) at org.apache.maven.lifecycle.internal.LifecycleStarter.singleThreadedBuild(LifecycleStarter.java:183) at org.apache.maven.lifecycle.internal.LifecycleStarter.execute(LifecycleStarter.java:161) at org.apache.maven.DefaultMaven.doExecute(DefaultMaven.java:317) at org.apache.maven.DefaultMaven.execute(DefaultMaven.java:152) at org.apache.maven.cli.MavenCli.execute(MavenCli.java:555) at org.apache.maven.cli.MavenCli.doMain(MavenCli.java:214) at org.apache.maven.cli.MavenCli.main(MavenCli.java:158) at sun.reflect.NativeMethodAccessorImpl.invoke0(Native Method) at sun.reflect.NativeMethodAccessorImpl.invoke(NativeMethodAccessorImpl.java:39) at sun.reflect.DelegatingMethodAccessorImpl.invoke(DelegatingMethodAccessorImpl.java:25) at java.lang.reflect.Method.invoke(Method.java:597) at org.codehaus.plexus.classworlds.launcher.Launcher.launchEnhanced(Launcher.java:289) at org.codehaus.plexus.classworlds.launcher.Launcher.launch(Launcher.java:229) at org.codehaus.plexus.classworlds.launcher.Launcher.mainWithExitCode(Launcher.java:415) at org.codehaus.plexus.classworlds.launcher.Launcher.main(Launcher.java:356) Caused by: org.apache.maven.plugin.MojoExecutionException: target/repository/plugins is not a directory. at org.jboss.tools.tycho.sitegenerator.FetchSourcesFromManifests.listFilesMatching(FetchSourcesFromManifests.java:363) at org.jboss.tools.tycho.sitegenerator.FetchSourcesFromManifests.execute(FetchSourcesFromManifests.java:191) at org.apache.maven.plugin.DefaultBuildPluginManager.executeMojo(DefaultBuildPluginManager.java:106) at org.apache.maven.lifecycle.internal.MojoExecutor.execute(MojoExecutor.java:208) ... 19 more [ERROR] [ERROR] Re-run Maven using the -X switch to enable full debug logging. [ERROR] [ERROR] For more information about the errors and possible solutions, please read the following articles: [ERROR] [Help 1]
http://cwiki.apache.org/confluence/display/MAVEN/MojoExecutionException
Build step 'Invoke top-level Maven targets' marked build as failure Description set:
0
/
0
Reply
Back to the thread
Back to the list