[
http://jira.jboss.com/jira/browse/JBAS-5054?page=comments#action_12391402 ]
Anil Saldhana commented on JBAS-5054:
-------------------------------------
Looks much better now:
====================================================
[echo] Starting patternset=jacc.includes config=JACC
[junit] Running org.jboss.test.cmp2.audit.test.AuditUnitTestCase
[junit] Tests run: 7, Failures: 0, Errors: 0, Time elapsed: 25.734 sec
[junit] Running org.jboss.test.cmp2.cmrstress.CMRStressTestCase
[junit] Tests run: 1, Failures: 0, Errors: 0, Time elapsed: 7.157 sec
[junit] Running org.jboss.test.cmp2.cmrtransaction.test.CMRTransactionUnitTe
stCase
[junit] Tests run: 1, Failures: 0, Errors: 0, Time elapsed: 1.406 sec
[junit] Running org.jboss.test.cmp2.commerce.CompleteUnitTestCase
[junit] Tests run: 32, Failures: 0, Errors: 0, Time elapsed: 9.047 sec
[junit] Running org.jboss.test.cmp2.perf.test.PerfUnitTestCase
[junit] Tests run: 1, Failures: 0, Errors: 0, Time elapsed: 4.593 sec
[junit] Running org.jboss.test.cmp2.relationship.RelationshipUnitTestCase
[junit] Tests run: 21, Failures: 0, Errors: 0, Time elapsed: 4.828 sec
[junit] Running org.jboss.test.cmp2.simple.SimpleUnitTestCase
[junit] Tests run: 44, Failures: 0, Errors: 0, Time elapsed: 3.938 sec
[junit] Running org.jboss.test.jacc.test.CallerInRoleUnitTestCase
[junit] Tests run: 1, Failures: 0, Errors: 0, Time elapsed: 1.578 sec
[junit] Running org.jboss.test.jacc.test.EJBSpecUnitTestCase
[junit] Tests run: 23, Failures: 0, Errors: 3, Time elapsed: 50.829 sec
[junit] Test org.jboss.test.jacc.test.EJBSpecUnitTestCase FAILED
[junit] Running org.jboss.test.jacc.test.FormAuthUnitTestCase
[junit] Tests run: 5, Failures: 2, Errors: 0, Time elapsed: 18.625 sec
[junit] Test org.jboss.test.jacc.test.FormAuthUnitTestCase FAILED
[junit] Running org.jboss.test.jacc.test.JMXConsoleUnitTestCase
[junit] Tests run: 3, Failures: 0, Errors: 0, Time elapsed: 10.937 sec
[junit] Running org.jboss.test.jacc.test.MissingMethodUnitTestCase
[junit] Tests run: 2, Failures: 0, Errors: 1, Time elapsed: 1.625 sec
[junit] Test org.jboss.test.jacc.test.MissingMethodUnitTestCase FAILED
[junit] Running org.jboss.test.jacc.test.WebConstraintsUnitTestCase
[junit] Tests run: 4, Failures: 0, Errors: 3, Time elapsed: 12.016 sec
[junit] Test org.jboss.test.jacc.test.WebConstraintsUnitTestCase FAILED
[junit] Running org.jboss.test.jacc.test.WebIntegrationUnitTestCase
[junit] Tests run: 0, Failures: 0, Errors: 1, Time elapsed: 5.14 sec
[junit] Test org.jboss.test.jacc.test.WebIntegrationUnitTestCase FAILED
[junit] Running org.jboss.test.jacc.test.WebPermissionsValidationTestCase
[junit] Tests run: 1, Failures: 0, Errors: 0, Time elapsed: 1.344 sec
[junit] Running org.jboss.test.web.test.UserInRoleUnitTestCase
[junit] Tests run: 4, Failures: 0, Errors: 1, Time elapsed: 1.891 sec
[junit] Test org.jboss.test.web.test.UserInRoleUnitTestCase FAILED
[junit] Running org.jboss.test.webservice.jbws309.JBWS309TestCase
[junit] Tests run: 5, Failures: 0, Errors: 0, Time elapsed: 20.797 sec
[server:stop] Shutting down server: jacc
================================================================
tests-jacc-security failures
----------------------------
Key: JBAS-5054
URL:
http://jira.jboss.com/jira/browse/JBAS-5054
Project: JBoss Application Server
Issue Type: Sub-task
Security Level: Public(Everyone can see)
Components: Security
Reporter: Scott M Stark
Assigned To: Scott M Stark
Priority: Critical
Fix For: JBossAS-5.0.0.Beta3
There are many failures in the tests-jacc-security target.
[junit] Running org.jboss.test.cmp2.audit.test.AuditUnitTestCase
[junit] Tests run: 7, Failures: 0, Errors: 7, Time elapsed: 9.904 sec
[junit] Test org.jboss.test.cmp2.audit.test.AuditUnitTestCase FAILED
[junit] Running org.jboss.test.jacc.test.CallerInRoleUnitTestCase
[junit] Tests run: 1, Failures: 0, Errors: 1, Time elapsed: 0.8 sec
[junit] Test org.jboss.test.jacc.test.CallerInRoleUnitTestCase FAILED
[junit] Running org.jboss.test.jacc.test.EJBSpecUnitTestCase
[junit] Tests run: 23, Failures: 2, Errors: 20, Time elapsed: 21.539 sec
[junit] Test org.jboss.test.jacc.test.EJBSpecUnitTestCase FAILED
[junit] Running org.jboss.test.jacc.test.FormAuthUnitTestCase
[junit] Tests run: 5, Failures: 5, Errors: 0, Time elapsed: 1.088 sec
[junit] Test org.jboss.test.jacc.test.FormAuthUnitTestCase FAILED
[junit] Running org.jboss.test.jacc.test.MissingMethodUnitTestCase
[junit] Tests run: 2, Failures: 0, Errors: 2, Time elapsed: 0.948 sec
[junit] Test org.jboss.test.jacc.test.MissingMethodUnitTestCase FAILED
[junit] Running org.jboss.test.jacc.test.WebConstraintsUnitTestCase
[junit] Tests run: 4, Failures: 0, Errors: 3, Time elapsed: 10.921 sec
[junit] Test org.jboss.test.jacc.test.WebConstraintsUnitTestCase FAILED
[junit] Running org.jboss.test.jacc.test.WebIntegrationUnitTestCase
[junit] Tests run: 0, Failures: 0, Errors: 1, Time elapsed: 2.376 sec
[junit] Test org.jboss.test.jacc.test.WebIntegrationUnitTestCase FAILED
[junit] Running org.jboss.test.web.test.UserInRoleUnitTestCase
[junit] Tests run: 4, Failures: 0, Errors: 1, Time elapsed: 1.123 sec
[junit] Test org.jboss.test.web.test.UserInRoleUnitTestCase FAILED
[junit] Running org.jboss.test.webservice.jbws309.JBWS309TestCase
[junit] Tests run: 5, Failures: 3, Errors: 2, Time elapsed: 8.61 sec
[junit] Test org.jboss.test.webservice.jbws309.JBWS309TestCase FAILED
--
This message is automatically generated by JIRA.
-
If you think it was sent incorrectly contact one of the administrators:
http://jira.jboss.com/jira/secure/Administrators.jspa
-
For more information on JIRA, see:
http://www.atlassian.com/software/jira