[JBoss JIRA] (JBTM-2303) Cannot create jacoco report
by Tom Jenkinson (JIRA)
[ https://issues.jboss.org/browse/JBTM-2303?page=com.atlassian.jira.plugin.... ]
Tom Jenkinson closed JBTM-2303.
-------------------------------
> Cannot create jacoco report
> ---------------------------
>
> Key: JBTM-2303
> URL: https://issues.jboss.org/browse/JBTM-2303
> Project: JBoss Transaction Manager
> Issue Type: Bug
> Components: Build System
> Reporter: Tom Jenkinson
> Assignee: Michael Musgrove
> Fix For: 5.0.4
>
>
> {quote}
> [jacoco:coverage] Enhancing junit with coverage
> [junit] Running org.jboss.jbossts.qa.junit.testgroup.TestGroup_jdbcresources02_pgsql_jndi
> [junit] Tests run: 30, Failures: 0, Errors: 0, Time elapsed: 412.658 sec
> ci-tests:
> BUILD SUCCESSFUL
> Total time: 447 minutes 53 seconds
> generating test coverage report
> Buildfile: /home/hudson/workspace/narayana-codeCoverage/qa/run-tests.xml
> jacoco-report:
> [jacoco:report] Loading execution data file /home/hudson/workspace/narayana-codeCoverage/qa/testoutput/jacoco-qa.exec
> BUILD FAILED
> /home/hudson/workspace/narayana-codeCoverage/qa/run-tests.xml:544: Error while creating report
> {quote}
--
This message was sent by Atlassian JIRA
(v7.5.0#75005)
6 years, 7 months
[JBoss JIRA] (JBTM-2314) JTS Jacoco report missing
by Tom Jenkinson (JIRA)
[ https://issues.jboss.org/browse/JBTM-2314?page=com.atlassian.jira.plugin.... ]
Tom Jenkinson closed JBTM-2314.
-------------------------------
> JTS Jacoco report missing
> -------------------------
>
> Key: JBTM-2314
> URL: https://issues.jboss.org/browse/JBTM-2314
> Project: JBoss Transaction Manager
> Issue Type: Bug
> Components: Build System
> Reporter: Michael Musgrove
> Assignee: Michael Musgrove
>
> JTS Jacoco report is for jacorb is missing.
> Also check for any others that might be missing - the ones our CI job is currently producing are:
> ../STM/target/site/jacoco-ut/jacoco.csv
> ../tools/target/site/jacoco-ut/jacoco.csv
> ../ArjunaCore/txoj/target/site/jacoco-ut/jacoco.csv
> ../ArjunaCore/arjuna/target/site/jacoco-ut/jacoco.csv
> ../rts/at/integration/target/site/jacoco-ut/jacoco.csv
> ../rts/at/tx/target/site/jacoco-ut/jacoco.csv
> ../rts/at/bridge/target/site/jacoco-ut/jacoco.csv
> ../ArjunaJTA/jta/target/site/jacoco-ut/jacoco.csv
> ../ArjunaJTA/cdi/target/site/jacoco-ut/jacoco.csv
> ../txbridge/target/site/jacoco-ut/jacoco.csv
> ../common/target/site/jacoco-ut/jacoco.csv
> ../compensations/target/site/jacoco-ut/jacoco.csv
--
This message was sent by Atlassian JIRA
(v7.5.0#75005)
6 years, 7 months
[JBoss JIRA] (JBTM-2303) Cannot create jacoco report
by Tom Jenkinson (JIRA)
[ https://issues.jboss.org/browse/JBTM-2303?page=com.atlassian.jira.plugin.... ]
Tom Jenkinson updated JBTM-2303:
--------------------------------
Fix Version/s: 5.0.4
> Cannot create jacoco report
> ---------------------------
>
> Key: JBTM-2303
> URL: https://issues.jboss.org/browse/JBTM-2303
> Project: JBoss Transaction Manager
> Issue Type: Bug
> Components: Build System
> Reporter: Tom Jenkinson
> Assignee: Michael Musgrove
> Fix For: 5.0.4
>
>
> {quote}
> [jacoco:coverage] Enhancing junit with coverage
> [junit] Running org.jboss.jbossts.qa.junit.testgroup.TestGroup_jdbcresources02_pgsql_jndi
> [junit] Tests run: 30, Failures: 0, Errors: 0, Time elapsed: 412.658 sec
> ci-tests:
> BUILD SUCCESSFUL
> Total time: 447 minutes 53 seconds
> generating test coverage report
> Buildfile: /home/hudson/workspace/narayana-codeCoverage/qa/run-tests.xml
> jacoco-report:
> [jacoco:report] Loading execution data file /home/hudson/workspace/narayana-codeCoverage/qa/testoutput/jacoco-qa.exec
> BUILD FAILED
> /home/hudson/workspace/narayana-codeCoverage/qa/run-tests.xml:544: Error while creating report
> {quote}
--
This message was sent by Atlassian JIRA
(v7.5.0#75005)
6 years, 7 months
[JBoss JIRA] (JBTM-2304) Cannot compile TestModule.idl using IBM stub compiler (JDK8)
by Tom Jenkinson (JIRA)
[ https://issues.jboss.org/browse/JBTM-2304?page=com.atlassian.jira.plugin.... ]
Tom Jenkinson closed JBTM-2304.
-------------------------------
> Cannot compile TestModule.idl using IBM stub compiler (JDK8)
> ------------------------------------------------------------
>
> Key: JBTM-2304
> URL: https://issues.jboss.org/browse/JBTM-2304
> Project: JBoss Transaction Manager
> Issue Type: Bug
> Components: Build System, JTS
> Reporter: Tom Jenkinson
> Assignee: Michael Musgrove
> Fix For: 5.2.0
>
>
> {quote}
> org.jboss.jbossts.qa.idl.compile.init:
> [idl-compiler] Parsing...
> [idl-compiler] Processing for ibmorb '/home/hudson/workspace/narayana-ibm-jdk/qa/dist/../../ArjunaJTS/idl/src/test/idl/TestModule.idl'
> BUILD FAILED
> /home/hudson/workspace/narayana-ibm-jdk/qa/build.xml:123: The following error occurred while executing this line:
> /home/hudson/workspace/narayana-ibm-jdk/qa/tests/build-jts.xml:229: Failed to compile '/home/hudson/workspace/narayana-ibm-jdk/qa/dist/../../ArjunaJTS/idl/src/test/idl/TestModule.idl' file
> Total time: 2 seconds
> qa build failed
> {quote}
--
This message was sent by Atlassian JIRA
(v7.5.0#75005)
6 years, 7 months
[JBoss JIRA] (JBTM-2304) Cannot compile TestModule.idl using IBM stub compiler (JDK8)
by Tom Jenkinson (JIRA)
[ https://issues.jboss.org/browse/JBTM-2304?page=com.atlassian.jira.plugin.... ]
Tom Jenkinson updated JBTM-2304:
--------------------------------
Fix Version/s: 5.2.0
> Cannot compile TestModule.idl using IBM stub compiler (JDK8)
> ------------------------------------------------------------
>
> Key: JBTM-2304
> URL: https://issues.jboss.org/browse/JBTM-2304
> Project: JBoss Transaction Manager
> Issue Type: Bug
> Components: Build System, JTS
> Reporter: Tom Jenkinson
> Assignee: Michael Musgrove
> Fix For: 5.2.0
>
>
> {quote}
> org.jboss.jbossts.qa.idl.compile.init:
> [idl-compiler] Parsing...
> [idl-compiler] Processing for ibmorb '/home/hudson/workspace/narayana-ibm-jdk/qa/dist/../../ArjunaJTS/idl/src/test/idl/TestModule.idl'
> BUILD FAILED
> /home/hudson/workspace/narayana-ibm-jdk/qa/build.xml:123: The following error occurred while executing this line:
> /home/hudson/workspace/narayana-ibm-jdk/qa/tests/build-jts.xml:229: Failed to compile '/home/hudson/workspace/narayana-ibm-jdk/qa/dist/../../ArjunaJTS/idl/src/test/idl/TestModule.idl' file
> Total time: 2 seconds
> qa build failed
> {quote}
--
This message was sent by Atlassian JIRA
(v7.5.0#75005)
6 years, 7 months
[JBoss JIRA] (JBTM-2281) Merge the documentation manuals together
by Tom Jenkinson (JIRA)
[ https://issues.jboss.org/browse/JBTM-2281?page=com.atlassian.jira.plugin.... ]
Tom Jenkinson updated JBTM-2281:
--------------------------------
Fix Version/s: 5.2.0
> Merge the documentation manuals together
> ----------------------------------------
>
> Key: JBTM-2281
> URL: https://issues.jboss.org/browse/JBTM-2281
> Project: JBoss Transaction Manager
> Issue Type: Feature Request
> Components: Documentation
> Reporter: Tom Jenkinson
> Assignee: Gytis Trikleris
> Fix For: 5.2.0
>
>
> The documentation for our project is available here:
> Narayana Documentation 5.0.2.Final - JBoss Community
>
> As you can see it consists of several downloads including multiple books, links to various JavaDocs and some IDL files. Personally I think it might be easier to locate documentation entries if there is a single document to consult and a single JavaDoc link. I consulted our users whether anyone would object to us producing a single document and single JavaDoc set and received no objection. I am also thinking of no longer publishing the IDL as separate files as these are always tagged and available in our repo.
> One way or another we need to make it clear in the docs what is in product and what is in project. Its not quite so important for our community users to know this but when translating docs into product manuals it is crucial. Currently this is done because everything under https://github.com/jbosstm/documentation/tree/master/docs is product related and things one level up are various community projects. An obvious way to merge the docs is merge everything under docs and then everything under ../* except docs - i.e. 2 manuals
--
This message was sent by Atlassian JIRA
(v7.5.0#75005)
6 years, 7 months