Gytis Trikleris created JBTM-2645:
-------------------------------------
Summary:
XARecoveryModuleHelpersUnitTest.testTimelyXAResourceRecoveryHelperRemoval2 failure
Key: JBTM-2645
URL:
https://issues.jboss.org/browse/JBTM-2645
Project: JBoss Transaction Manager
Issue Type: Bug
Components: JTA
Reporter: Gytis Trikleris
Priority: Minor
{code}
Running com.hp.mwtests.ts.jta.recovery.XARecoveryModuleHelpersUnitTest
Tests run: 3, Failures: 1, Errors: 0, Skipped: 0, Time elapsed: 7.636 sec <<<
FAILURE! - in com.hp.mwtests.ts.jta.recovery.XARecoveryModuleHelpersUnitTest
testTimelyXAResourceRecoveryHelperRemoval2(com.hp.mwtests.ts.jta.recovery.XARecoveryModuleHelpersUnitTest)
Time elapsed: 2.616 sec <<< FAILURE!
java.lang.AssertionError: helper2 removed in wrong state expected:<2> but
was:<0>
at org.junit.Assert.fail(Assert.java:88)
at org.junit.Assert.failNotEquals(Assert.java:743)
at org.junit.Assert.assertEquals(Assert.java:118)
at org.junit.Assert.assertEquals(Assert.java:555)
at
com.hp.mwtests.ts.jta.recovery.XARecoveryModuleHelpersUnitTest.testTimelyXAResourceRecoveryHelperRemoval(XARecoveryModuleHelpersUnitTest.java:212)
at
com.hp.mwtests.ts.jta.recovery.XARecoveryModuleHelpersUnitTest.testTimelyXAResourceRecoveryHelperRemoval2(XARecoveryModuleHelpersUnitTest.java:64)
{code}
--
This message was sent by Atlassian JIRA
(v6.4.11#64026)